stog-writing

Stog plugin adding new rewrite rules to use footnotes and bibliographies in documents

Error log

The package failed to build. The error log from opam follows.

You are using opam 2.1+, where external dependency handling has been integrated: consider calling opam directly, the 'depext' plugin interface is provided for backwards compatibility only
# Detecting depexts using vars: arch=x86_64, os=linux, os-distribution=debian, os-family=debian
# The following system packages are needed:
pkg-config
[NOTE] Package ocamlfind is already installed (current version is 1.9.5).
[NOTE] Package dune is already installed (current version is 3.4.1).
The following actions will be performed:
  - install cppo                1.6.9
  - install ppx_derivers        1.2.1
  - install menhirLib           20220210
  - install pp                  1.1.2
  - install seq                 base
  - install base-bytes          base
  - install ocaml-syntax-shims  1.0.0
  - install sexplib0            v0.15.1
  - install ocamlbuild          0.14.1
  - install stdlib-shims        0.3.0
  - install conf-pkg-config     2
  - install menhirSdk           20220210
  - install csexp               1.5.1
  - install stringext           1.6.0
  - install result              1.5
  - install ordering            3.4.1
  - install ocaml-compiler-libs v0.12.4
  - install dune-build-info     3.4.1
  - install yojson              2.0.2
  - install re                  1.10.4
  - install ocplib-endian       1.2
  - install uchar               0.0.2
  - install topkg               1.0.5
  - install bigstringaf         0.9.0
  - install menhir              20220210
  - install dune-configurator   3.4.1
  - install dyn                 3.4.1
  - install ppxlib              0.27.0
  - install ocf                 0.8.0
  - install uutf                1.0.3
  - install ptime               1.0.0
  - install fmt                 0.9.0
  - install angstrom            0.15.0
  - install lwt                 5.6.1
  - install gen                 1.0
  - install stdune              3.4.1
  - install ppx_blob            0.7.2
  - install ocf_ppx             0.8.0
  - install uunf                14.0.0
  - install uri                 4.2.0
  - install lwt_ppx             2.1.0
  - install logs                0.7.0
  - install sedlex              3.0
  - install dune-private-libs   3.4.1
  - install iri                 0.6.0
  - install dune-site           3.4.1
  - install xtmpl               0.19.0
  - install xtmpl_ppx           0.19.0
  - install higlo               0.8
  - install stog                0.20.0
  - install stog-writing        0.19.0
===== 51 to install =====

The following system packages will first need to be installed:
    pkg-config

<><> Handling external dependencies <><><><><><><><><><><><><><><><><><><><><><>
Let opam run your package manager to install the required system packages?
(answer 'n' for other options) [Y/n] y
+ /usr/bin/sudo "apt-get" "install" "-qq" "-yy" "pkg-config"
- debconf: delaying package configuration, since apt-utils is not installed
- Selecting previously unselected package libglib2.0-0:amd64.
- (Reading database ... 
(Reading database ... 5%
(Reading database ... 10%
(Reading database ... 15%
(Reading database ... 20%
(Reading database ... 25%
(Reading database ... 30%
(Reading database ... 35%
(Reading database ... 40%
(Reading database ... 45%
(Reading database ... 50%
(Reading database ... 55%
(Reading database ... 60%
(Reading database ... 65%
(Reading database ... 70%
(Reading database ... 75%
(Reading database ... 80%
(Reading database ... 85%
(Reading database ... 90%
(Reading database ... 95%
(Reading database ... 100%
(Reading database ... 18332 files and directories currently installed.)
- Preparing to unpack .../0-libglib2.0-0_2.66.8-1_amd64.deb ...
- Unpacking libglib2.0-0:amd64 (2.66.8-1) ...
- Selecting previously unselected package libglib2.0-data.
- Preparing to unpack .../1-libglib2.0-data_2.66.8-1_all.deb ...
- Unpacking libglib2.0-data (2.66.8-1) ...
- Selecting previously unselected package libicu67:amd64.
- Preparing to unpack .../2-libicu67_67.1-7_amd64.deb ...
- Unpacking libicu67:amd64 (67.1-7) ...
- Selecting previously unselected package libxml2:amd64.
- Preparing to unpack .../3-libxml2_2.9.10+dfsg-6.7+deb11u3_amd64.deb ...
- Unpacking libxml2:amd64 (2.9.10+dfsg-6.7+deb11u3) ...
- Selecting previously unselected package pkg-config.
- Preparing to unpack .../4-pkg-config_0.29.2-1_amd64.deb ...
- Unpacking pkg-config (0.29.2-1) ...
- Selecting previously unselected package shared-mime-info.
- Preparing to unpack .../5-shared-mime-info_2.0-1_amd64.deb ...
- Unpacking shared-mime-info (2.0-1) ...
- Selecting previously unselected package xdg-user-dirs.
- Preparing to unpack .../6-xdg-user-dirs_0.17-2_amd64.deb ...
- Unpacking xdg-user-dirs (0.17-2) ...
- Setting up libicu67:amd64 (67.1-7) ...
- Setting up xdg-user-dirs (0.17-2) ...
- Setting up libglib2.0-0:amd64 (2.66.8-1) ...
- No schema files found: doing nothing.
- Setting up libglib2.0-data (2.66.8-1) ...
- Setting up pkg-config (0.29.2-1) ...
- Setting up libxml2:amd64 (2.9.10+dfsg-6.7+deb11u3) ...
- Setting up shared-mime-info (2.0-1) ...
- Processing triggers for libc-bin (2.31-13+deb11u5) ...

<><> Processing actions <><><><><><><><><><><><><><><><><><><><><><><><><><><><>
Processing  1/153:
Processing  2/153:
Processing  3/153:
Processing  4/153:
Processing  5/153:
Processing  6/153:
Processing  7/153: [conf-pkg-config: pkg-config]
-> installed base-bytes.base
Processing  8/153: [conf-pkg-config: pkg-config]
-> retrieved angstrom.0.15.0  (cached)
Processing  9/153: [conf-pkg-config: pkg-config]
-> retrieved bigstringaf.0.9.0  (cached)
Processing 10/153: [conf-pkg-config: pkg-config]
-> retrieved cppo.1.6.9  (cached)
Processing 11/153: [conf-pkg-config: pkg-config]
Processing 12/153: [conf-pkg-config: pkg-config] [cppo: dune build]
- Usage:
-   pkg-config [OPTION?]
- 
- Help Options:
-   -h, --help                              Show help options
- 
- Application Options:
-   --version                               output version of pkg-config
-   --modversion                            output version for package
-   --atleast-pkgconfig-version=VERSION     require given version of pkg-config
-   --libs                                  output all linker flags
-   --static                                output linker flags for static linking
-   --short-errors                          print short errors
-   --libs-only-l                           output -l flags
-   --libs-only-other                       output other libs (e.g. -pthread)
-   --libs-only-L                           output -L flags
-   --cflags                                output all pre-processor and compiler flags
-   --cflags-only-I                         output -I flags
-   --cflags-only-other                     output cflags not covered by the cflags-only-I option
-   --variable=NAME                         get the value of variable named NAME
-   --define-variable=NAME=VALUE            set variable NAME to VALUE
-   --exists                                return 0 if the module(s) exist
-   --print-variables                       output list of variables defined by the module
-   --uninstalled                           return 0 if the uninstalled version of one or more module(s) or their dependencies will be used
-   --atleast-version=VERSION               return 0 if the module is at least version VERSION
-   --exact-version=VERSION                 return 0 if the module is at exactly version VERSION
-   --max-version=VERSION                   return 0 if the module is at no newer than version VERSION
-   --list-all                              list all known packages
-   --debug                                 show verbose debug information
-   --print-errors                          show verbose information about missing or conflicting packages (default unless --exists or --atleast/exact/max-version given on the command line)
-   --silence-errors                        be silent about errors (default when --exists or --atleast/exact/max-version given on the command line)
-   --errors-to-stdout                      print errors from --print-errors to stdout not stderr
-   --print-provides                        print which packages the package provides
-   --print-requires                        print which packages the package requires
-   --print-requires-private                print which packages the package requires for static linking
-   --validate                              validate a package's .pc file
-   --define-prefix                         try to override the value of prefix for each .pc file found with a guesstimated value based on the location of the .pc file
-   --dont-define-prefix                    don't try to override the value of prefix for each .pc file found with a guesstimated value based on the location of the .pc file
-   --prefix-variable=PREFIX                set the name of the variable that pkg-config automatically sets
- 
-> compiled  conf-pkg-config.2
Processing 12/153: [cppo: dune build]
Processing 13/153: [cppo: dune build] [conf-pkg-config: mkdir]
-> retrieved csexp.1.5.1  (cached)
Processing 14/153: [cppo: dune build] [conf-pkg-config: mkdir]
Processing 15/153: [cppo: dune build] [csexp: dune build] [conf-pkg-config: mkdir]
-> retrieved dune-build-info.3.4.1  (cached)
Processing 16/153: [cppo: dune build] [csexp: dune build] [conf-pkg-config: mkdir]
Processing 17/153: [cppo: dune build] [csexp: dune build] [dune-build-info: rm] [conf-pkg-config: mkdir]
-> retrieved dune-configurator.3.4.1  (cached)
Processing 18/153: [cppo: dune build] [csexp: dune build] [dune-build-info: rm] [conf-pkg-config: mkdir]
-> compiled  cppo.1.6.9
Processing 18/153: [csexp: dune build] [dune-build-info: rm] [conf-pkg-config: mkdir]
-> installed conf-pkg-config.2
Processing 18/153: [csexp: dune build] [dune-build-info: rm]
Processing 19/153: [bigstringaf: dune build] [csexp: dune build] [dune-build-info: rm]
-> installed cppo.1.6.9
Processing 20/153: [bigstringaf: dune build] [csexp: dune build] [dune-build-info: rm]
-> retrieved dune-private-libs.3.4.1  (cached)
Processing 21/153: [bigstringaf: dune build] [csexp: dune build] [dune-build-info: rm]
-> compiled  csexp.1.5.1
Processing 21/153: [bigstringaf: dune build] [dune-build-info: rm]
-> installed csexp.1.5.1
Processing 22/153: [bigstringaf: dune build] [dune-build-info: rm]
Processing 23/153: [bigstringaf: dune build] [dune-build-info: rm] [dune-configurator: rm]
-> retrieved dune-site.3.4.1  (cached)
Processing 24/153: [bigstringaf: dune build] [dune-build-info: rm] [dune-configurator: rm]
-> retrieved dyn.3.4.1  (cached)
Processing 25/153: [bigstringaf: dune build] [dune-build-info: rm] [dune-configurator: rm]
- (cd _build/default/lib/freestanding && /usr/bin/gmake)
- touch libbigstringaf_freestanding_stubs.a
-> compiled  bigstringaf.0.9.0
Processing 25/153: [dune-build-info: rm] [dune-configurator: rm]
-> installed bigstringaf.0.9.0
Processing 26/153: [dune-build-info: rm] [dune-configurator: rm]
-> retrieved fmt.0.9.0  (cached)
Processing 27/153: [dune-build-info: rm] [dune-configurator: rm]
-> retrieved gen.1.0  (cached)
Processing 28/153: [dune-build-info: rm] [dune-configurator: rm]
Processing 28/153: [dune-build-info: dune build] [dune-configurator: rm]
-> retrieved higlo.0.8  (cached)
Processing 29/153: [dune-build-info: dune build] [dune-configurator: rm]
-> retrieved iri.0.6.0  (cached)
Processing 30/153: [dune-build-info: dune build] [dune-configurator: rm]
Processing 30/153: [dune-build-info: dune build] [dune-configurator: dune build]
-> retrieved logs.0.7.0  (cached)
Processing 31/153: [dune-build-info: dune build] [dune-configurator: dune build]
-> retrieved lwt.5.6.1  (cached)
Processing 32/153: [dune-build-info: dune build] [dune-configurator: dune build]
-> retrieved lwt_ppx.2.1.0  (cached)
Processing 33/153: [dune-build-info: dune build] [dune-configurator: dune build]
-> retrieved menhir.20220210  (cached)
Processing 34/153: [dune-build-info: dune build] [dune-configurator: dune build]
-> retrieved menhirLib.20220210  (cached)
Processing 35/153: [dune-build-info: dune build] [dune-configurator: dune build]
Processing 36/153: [dune-build-info: dune build] [dune-configurator: dune build] [menhirLib: dune build]
-> retrieved menhirSdk.20220210  (cached)
Processing 37/153: [dune-build-info: dune build] [dune-configurator: dune build] [menhirLib: dune build]
Processing 38/153: [dune-build-info: dune build] [dune-configurator: dune build] [menhirLib: dune build] [menhirSdk: dune build]
-> retrieved ocaml-compiler-libs.v0.12.4  (cached)
Processing 39/153: [dune-build-info: dune build] [dune-configurator: dune build] [menhirLib: dune build] [menhirSdk: dune build]
Processing 40/153: [dune-build-info: dune build] [dune-configurator: dune build] [menhirLib: dune build] [menhirSdk: dune build] [ocaml-compiler-libs: dune build]
-> retrieved ocaml-syntax-shims.1.0.0  (cached)
Processing 41/153: [dune-build-info: dune build] [dune-configurator: dune build] [menhirLib: dune build] [menhirSdk: dune build] [ocaml-compiler-libs: dune build]
Processing 42/153: [dune-build-info: dune build] [dune-configurator: dune build] [menhirLib: dune build] [menhirSdk: dune build] [ocaml-compiler-libs: dune build] [ocaml-syntax-shims: dune build]
-> retrieved ocamlbuild.0.14.1  (cached)
Processing 43/153: [dune-build-info: dune build] [dune-configurator: dune build] [menhirLib: dune build] [menhirSdk: dune build] [ocaml-compiler-libs: dune build] [ocaml-syntax-shims: dune build]
Processing 44/153: [dune-build-info: dune build] [dune-configurator: dune build] [menhirLib: dune build] [menhirSdk: dune build] [ocaml-compiler-libs: dune build] [ocaml-syntax-shims: dune build] [ocamlbuild: make configure.make]
-> compiled  dune-build-info.3.4.1
Processing 44/153: [dune-configurator: dune build] [menhirLib: dune build] [menhirSdk: dune build] [ocaml-compiler-libs: dune build] [ocaml-syntax-shims: dune build] [ocamlbuild: make configure.make]
-> installed dune-build-info.3.4.1
Processing 45/153: [dune-configurator: dune build] [menhirLib: dune build] [menhirSdk: dune build] [ocaml-compiler-libs: dune build] [ocaml-syntax-shims: dune build] [ocamlbuild: make configure.make]
-> retrieved ocf.0.8.0  (cached)
Processing 46/153: [dune-configurator: dune build] [menhirLib: dune build] [menhirSdk: dune build] [ocaml-compiler-libs: dune build] [ocaml-syntax-shims: dune build] [ocamlbuild: make configure.make]
-> retrieved ocf_ppx.0.8.0  (cached)
Processing 47/153: [dune-configurator: dune build] [menhirLib: dune build] [menhirSdk: dune build] [ocaml-compiler-libs: dune build] [ocaml-syntax-shims: dune build] [ocamlbuild: make configure.make]
-> retrieved ocplib-endian.1.2  (cached)
Processing 48/153: [dune-configurator: dune build] [menhirLib: dune build] [menhirSdk: dune build] [ocaml-compiler-libs: dune build] [ocaml-syntax-shims: dune build] [ocamlbuild: make configure.make]
Processing 49/153: [dune-configurator: dune build] [menhirLib: dune build] [menhirSdk: dune build] [ocaml-compiler-libs: dune build] [ocaml-syntax-shims: dune build] [ocamlbuild: make configure.make] [ocplib-endian: dune build]
- (echo "# This file was generated from configure.make"; \
- echo ;\
- echo "OCAML_PREFIX="; \
- echo "OCAML_BINDIR=/home/opam/.opam/4.12/bin"; \
- echo "OCAML_LIBDIR=/home/opam/.opam/4.12/lib/ocaml"; \
- echo "OCAML_MANDIR=/home/opam/.opam/4.12/man"; \
- echo ;\
- echo "EXT_OBJ=.o"; \
- echo "EXT_ASM=.s"; \
- echo "EXT_LIB=.a"; \
- echo "EXT_DLL=.so"; \
- echo "EXE="; \
- echo ;\
- echo "OCAML_NATIVE=true"; \
- echo "OCAML_NATIVE_TOOLS=true"; \
- echo "NATDYNLINK=true"; \
- echo "SUPPORT_SHARED_LIBRARIES=true"; \
- echo ;\
- echo "PREFIX=/home/opam/.opam/4.12"; \
- echo "BINDIR=/home/opam/.opam/4.12/bin"; \
- echo "LIBDIR=/home/opam/.opam/4.12/lib"; \
- echo "MANDIR=/home/opam/.opam/4.12/man"; \
- ) > Makefile.config
- (echo "(* This file was generated from ../configure.make *)"; \
- echo ;\
- echo 'let bindir = "/home/opam/.opam/4.12/bin"'; \
- echo 'let libdir = "/home/opam/.opam/4.12/lib"'; \
- echo 'let ocaml_libdir = "/home/opam/.opam/4.12/lib/ocaml"'; \
- echo 'let libdir_abs = "/home/opam/.opam/4.12/lib"'; \
- echo 'let ocaml_native = true'; \
- echo 'let ocaml_native_tools = true'; \
- echo 'let supports_shared_libraries = true';\
- echo 'let a = "a"'; \
- echo 'let o = "o"'; \
- echo 'let so = "so"'; \
- echo 'let ext_dll = ".so"'; \
- echo 'let exe = ""'; \
- echo 'let version = "0.14.1"'; \
- ) > src/ocamlbuild_config.ml
Processing 49/153: [dune-configurator: dune build] [menhirLib: dune build] [menhirSdk: dune build] [ocaml-compiler-libs: dune build] [ocaml-syntax-shims: dune build] [ocamlbuild: make check-if-preinstalled] [ocplib-endian: dune build]
-> retrieved pp.1.1.2  (cached)
Processing 50/153: [dune-configurator: dune build] [menhirLib: dune build] [menhirSdk: dune build] [ocaml-compiler-libs: dune build] [ocaml-syntax-shims: dune build] [ocamlbuild: make check-if-preinstalled] [ocplib-endian: dune build]
Processing 51/153: [dune-configurator: dune build] [menhirLib: dune build] [menhirSdk: dune build] [ocaml-compiler-libs: dune build] [ocaml-syntax-shims: dune build] [ocamlbuild: make check-if-preinstalled] [ocplib-endian: dune build] [pp: dune build]
-> retrieved ppx_blob.0.7.2  (cached)
Processing 52/153: [dune-configurator: dune build] [menhirLib: dune build] [menhirSdk: dune build] [ocaml-compiler-libs: dune build] [ocaml-syntax-shims: dune build] [ocamlbuild: make check-if-preinstalled] [ocplib-endian: dune build] [pp: dune build]
-> retrieved ppx_derivers.1.2.1  (cached)
Processing 53/153: [dune-configurator: dune build] [menhirLib: dune build] [menhirSdk: dune build] [ocaml-compiler-libs: dune build] [ocaml-syntax-shims: dune build] [ocamlbuild: make check-if-preinstalled] [ocplib-endian: dune build] [pp: dune build]
Processing 54/153: [dune-configurator: dune build] [menhirLib: dune build] [menhirSdk: dune build] [ocaml-compiler-libs: dune build] [ocaml-syntax-shims: dune build] [ocamlbuild: make check-if-preinstalled] [ocplib-endian: dune build] [pp: dune build] [ppx_derivers: dune build]
-> retrieved ptime.1.0.0  (cached)
Processing 55/153: [dune-configurator: dune build] [menhirLib: dune build] [menhirSdk: dune build] [ocaml-compiler-libs: dune build] [ocaml-syntax-shims: dune build] [ocamlbuild: make check-if-preinstalled] [ocplib-endian: dune build] [pp: dune build] [ppx_derivers: dune build]
-> retrieved re.1.10.4  (cached)
Processing 56/153: [dune-configurator: dune build] [menhirLib: dune build] [menhirSdk: dune build] [ocaml-compiler-libs: dune build] [ocaml-syntax-shims: dune build] [ocamlbuild: make check-if-preinstalled] [ocplib-endian: dune build] [pp: dune build] [ppx_derivers: dune build]
-> retrieved ppxlib.0.27.0  (cached)
Processing 57/153: [dune-configurator: dune build] [menhirLib: dune build] [menhirSdk: dune build] [ocaml-compiler-libs: dune build] [ocaml-syntax-shims: dune build] [ocamlbuild: make check-if-preinstalled] [ocplib-endian: dune build] [pp: dune build] [ppx_derivers: dune build]
- (cd _build/default/lib/pack && ./pack.exe)
- Creating menhirLib.ml...
- Creating menhirLib.mli...
-> compiled  menhirLib.20220210
Processing 57/153: [dune-configurator: dune build] [menhirSdk: dune build] [ocaml-compiler-libs: dune build] [ocaml-syntax-shims: dune build] [ocamlbuild: make check-if-preinstalled] [ocplib-endian: dune build] [pp: dune build] [ppx_derivers: dune build]
-> installed menhirLib.20220210
Processing 58/153: [dune-configurator: dune build] [menhirSdk: dune build] [ocaml-compiler-libs: dune build] [ocaml-syntax-shims: dune build] [ocamlbuild: make check-if-preinstalled] [ocplib-endian: dune build] [pp: dune build] [ppx_derivers: dune build]
-> compiled  menhirSdk.20220210
Processing 58/153: [dune-configurator: dune build] [ocaml-compiler-libs: dune build] [ocaml-syntax-shims: dune build] [ocamlbuild: make check-if-preinstalled] [ocplib-endian: dune build] [pp: dune build] [ppx_derivers: dune build]
-> installed menhirSdk.20220210
Processing 59/153: [dune-configurator: dune build] [ocaml-compiler-libs: dune build] [ocaml-syntax-shims: dune build] [ocamlbuild: make check-if-preinstalled] [ocplib-endian: dune build] [pp: dune build] [ppx_derivers: dune build]
Processing 60/153: [dune-configurator: dune build] [menhir: dune build] [ocaml-compiler-libs: dune build] [ocaml-syntax-shims: dune build] [ocamlbuild: make check-if-preinstalled] [ocplib-endian: dune build] [pp: dune build] [ppx_derivers: dune build]
-> compiled  pp.1.1.2
Processing 60/153: [dune-configurator: dune build] [menhir: dune build] [ocaml-compiler-libs: dune build] [ocaml-syntax-shims: dune build] [ocamlbuild: make check-if-preinstalled] [ocplib-endian: dune build] [ppx_derivers: dune build]
-> installed pp.1.1.2
Processing 61/153: [dune-configurator: dune build] [menhir: dune build] [ocaml-compiler-libs: dune build] [ocaml-syntax-shims: dune build] [ocamlbuild: make check-if-preinstalled] [ocplib-endian: dune build] [ppx_derivers: dune build]
-> compiled  ppx_derivers.1.2.1
Processing 61/153: [dune-configurator: dune build] [menhir: dune build] [ocaml-compiler-libs: dune build] [ocaml-syntax-shims: dune build] [ocamlbuild: make check-if-preinstalled] [ocplib-endian: dune build]
-> installed ppx_derivers.1.2.1
Processing 62/153: [dune-configurator: dune build] [menhir: dune build] [ocaml-compiler-libs: dune build] [ocaml-syntax-shims: dune build] [ocamlbuild: make check-if-preinstalled] [ocplib-endian: dune build]
-> retrieved result.1.5  (cached)
Processing 63/153: [dune-configurator: dune build] [menhir: dune build] [ocaml-compiler-libs: dune build] [ocaml-syntax-shims: dune build] [ocamlbuild: make check-if-preinstalled] [ocplib-endian: dune build]
Processing 64/153: [dune-configurator: dune build] [menhir: dune build] [ocaml-compiler-libs: dune build] [ocaml-syntax-shims: dune build] [ocamlbuild: make check-if-preinstalled] [ocplib-endian: dune build]
Processing 65/153: [dune-configurator: dune build] [menhir: dune build] [ocaml-compiler-libs: dune build] [ocaml-syntax-shims: dune build] [ocamlbuild: make check-if-preinstalled] [ocplib-endian: dune build] [result: dune build]
Processing 66/153: [dune-configurator: dune build] [menhir: dune build] [ocaml-compiler-libs: dune build] [ocaml-syntax-shims: dune build] [ocamlbuild: make check-if-preinstalled] [ocplib-endian: dune build] [result: dune build]
-> installed seq.base
Processing 67/153: [dune-configurator: dune build] [menhir: dune build] [ocaml-compiler-libs: dune build] [ocaml-syntax-shims: dune build] [ocamlbuild: make check-if-preinstalled] [ocplib-endian: dune build] [result: dune build]
Processing 68/153: [dune-configurator: dune build] [menhir: dune build] [ocaml-compiler-libs: dune build] [ocaml-syntax-shims: dune build] [ocamlbuild: make check-if-preinstalled] [ocplib-endian: dune build] [re: dune build] [result: dune build]
-> retrieved sedlex.3.0  (cached)
Processing 69/153: [dune-configurator: dune build] [menhir: dune build] [ocaml-compiler-libs: dune build] [ocaml-syntax-shims: dune build] [ocamlbuild: make check-if-preinstalled] [ocplib-endian: dune build] [re: dune build] [result: dune build]
-> retrieved sexplib0.v0.15.1  (cached)
Processing 70/153: [dune-configurator: dune build] [menhir: dune build] [ocaml-compiler-libs: dune build] [ocaml-syntax-shims: dune build] [ocamlbuild: make check-if-preinstalled] [ocplib-endian: dune build] [re: dune build] [result: dune build]
Processing 71/153: [dune-configurator: dune build] [menhir: dune build] [ocaml-compiler-libs: dune build] [ocaml-syntax-shims: dune build] [ocamlbuild: make check-if-preinstalled] [ocplib-endian: dune build] [re: dune build] [result: dune build] [sexplib0: dune build]
-> retrieved stdlib-shims.0.3.0  (cached)
Processing 72/153: [dune-configurator: dune build] [menhir: dune build] [ocaml-compiler-libs: dune build] [ocaml-syntax-shims: dune build] [ocamlbuild: make check-if-preinstalled] [ocplib-endian: dune build] [re: dune build] [result: dune build] [sexplib0: dune build]
Processing 73/153: [dune-configurator: dune build] [menhir: dune build] [ocaml-compiler-libs: dune build] [ocaml-syntax-shims: dune build] [ocamlbuild: make check-if-preinstalled] [ocplib-endian: dune build] [re: dune build] [result: dune build] [sexplib0: dune build] [stdlib-shims: dune build]
-> compiled  ocplib-endian.1.2
Processing 73/153: [dune-configurator: dune build] [menhir: dune build] [ocaml-compiler-libs: dune build] [ocaml-syntax-shims: dune build] [ocamlbuild: make check-if-preinstalled] [re: dune build] [result: dune build] [sexplib0: dune build] [stdlib-shims: dune build]
-> installed ocplib-endian.1.2
Processing 74/153: [dune-configurator: dune build] [menhir: dune build] [ocaml-compiler-libs: dune build] [ocaml-syntax-shims: dune build] [ocamlbuild: make check-if-preinstalled] [re: dune build] [result: dune build] [sexplib0: dune build] [stdlib-shims: dune build]
-> compiled  dune-configurator.3.4.1
Processing 74/153: [menhir: dune build] [ocaml-compiler-libs: dune build] [ocaml-syntax-shims: dune build] [ocamlbuild: make check-if-preinstalled] [re: dune build] [result: dune build] [sexplib0: dune build] [stdlib-shims: dune build]
-> installed dune-configurator.3.4.1
Processing 75/153: [menhir: dune build] [ocaml-compiler-libs: dune build] [ocaml-syntax-shims: dune build] [ocamlbuild: make check-if-preinstalled] [re: dune build] [result: dune build] [sexplib0: dune build] [stdlib-shims: dune build]
Processing 76/153: [gen: dune build] [menhir: dune build] [ocaml-compiler-libs: dune build] [ocaml-syntax-shims: dune build] [ocamlbuild: make check-if-preinstalled] [re: dune build] [result: dune build] [sexplib0: dune build] [stdlib-shims: dune build]
Processing 77/153: [gen: dune build] [lwt: dune exec] [menhir: dune build] [ocaml-compiler-libs: dune build] [ocaml-syntax-shims: dune build] [ocamlbuild: make check-if-preinstalled] [re: dune build] [result: dune build] [sexplib0: dune build] [stdlib-shims: dune build]
-> retrieved ordering.3.4.1  (cached)
Processing 78/153: [stog-writing.0.19.0: http] [gen: dune build] [lwt: dune exec] [menhir: dune build] [ocaml-compiler-libs: dune build] [ocaml-syntax-shims: dune build] [ocamlbuild: make check-if-preinstalled] [re: dune build] [result: dune build] [sexplib0: dune build] [stdlib-shims: dune build]
Processing 79/153: [stog-writing.0.19.0: http] [gen: dune build] [lwt: dune exec] [menhir: dune build] [ocaml-compiler-libs: dune build] [ocaml-syntax-shims: dune build] [ocamlbuild: make check-if-preinstalled] [ordering: rm] [re: dune build] [result: dune build] [sexplib0: dune build] [stdlib-shims: dune build]
-> compiled  ocaml-compiler-libs.v0.12.4
Processing 79/153: [stog-writing.0.19.0: http] [gen: dune build] [lwt: dune exec] [menhir: dune build] [ocaml-syntax-shims: dune build] [ocamlbuild: make check-if-preinstalled] [ordering: rm] [re: dune build] [result: dune build] [sexplib0: dune build] [stdlib-shims: dune build]
-> installed ocaml-compiler-libs.v0.12.4
Processing 80/153: [stog-writing.0.19.0: http] [gen: dune build] [lwt: dune exec] [menhir: dune build] [ocaml-syntax-shims: dune build] [ocamlbuild: make check-if-preinstalled] [ordering: rm] [re: dune build] [result: dune build] [sexplib0: dune build] [stdlib-shims: dune build]
-> compiled  ocaml-syntax-shims.1.0.0
Processing 80/153: [stog-writing.0.19.0: http] [gen: dune build] [lwt: dune exec] [menhir: dune build] [ocamlbuild: make check-if-preinstalled] [ordering: rm] [re: dune build] [result: dune build] [sexplib0: dune build] [stdlib-shims: dune build]
-> installed ocaml-syntax-shims.1.0.0
Processing 81/153: [stog-writing.0.19.0: http] [gen: dune build] [lwt: dune exec] [menhir: dune build] [ocamlbuild: make check-if-preinstalled] [ordering: rm] [re: dune build] [result: dune build] [sexplib0: dune build] [stdlib-shims: dune build]
- if test -d /home/opam/.opam/4.12/lib/ocaml/ocamlbuild; then\
-   >&2 echo "ERROR: Preinstalled ocamlbuild detected at"\
-        "/home/opam/.opam/4.12/lib/ocaml/ocamlbuild";\
-   >&2 echo "Installation aborted; if you want to bypass this"\
-         "safety check, pass CHECK_IF_PREINSTALLED=false to make";\
-   exit 2;\
- fi
- ocamlc.opt -w +L -w +R -w +Z -I src -I +unix -safe-string -bin-annot -strict-sequence -c src/const.ml
- ocamlc.opt -w +L -w +R -w +Z -I src -I +unix -safe-string -bin-annot -strict-sequence -c src/loc.mli
- ocamlc.opt -w +L -w +R -w +Z -I src -I +unix -safe-string -bin-annot -strict-sequence -c src/loc.ml
- ocamlc.opt -w +L -w +R -w +Z -I src -I +unix -safe-string -bin-annot -strict-sequence -c src/discard_printf.mli
- ocamlc.opt -w +L -w +R -w +Z -I src -I +unix -safe-string -bin-annot -strict-sequence -c src/discard_printf.ml
- ocamlc.opt -w +L -w +R -w +Z -I src -I +unix -safe-string -bin-annot -strict-sequence -c src/signatures.mli
- ocamlc.opt -w +L -w +R -w +Z -I src -I +unix -safe-string -bin-annot -strict-sequence -c src/my_std.mli
- ocamlc.opt -w +L -w +R -w +Z -I src -I +unix -safe-string -bin-annot -strict-sequence -c src/my_std.ml
- ocamlc.opt -w +L -w +R -w +Z -I src -I +unix -safe-string -bin-annot -strict-sequence -c src/my_unix.mli
- ocamlc.opt -w +L -w +R -w +Z -I src -I +unix -safe-string -bin-annot -strict-sequence -c src/my_unix.ml
- ocamlc.opt -w +L -w +R -w +Z -I src -I +unix -safe-string -bin-annot -strict-sequence -c src/tags.mli
- ocamlc.opt -w +L -w +R -w +Z -I src -I +unix -safe-string -bin-annot -strict-sequence -c src/tags.ml
- ocamlc.opt -w +L -w +R -w +Z -I src -I +unix -safe-string -bin-annot -strict-sequence -c src/display.mli
- ocamlc.opt -w +L -w +R -w +Z -I src -I +unix -safe-string -bin-annot -strict-sequence -c src/display.ml
- ocamlc.opt -w +L -w +R -w +Z -I src -I +unix -safe-string -bin-annot -strict-sequence -c src/log.mli
- ocamlc.opt -w +L -w +R -w +Z -I src -I +unix -safe-string -bin-annot -strict-sequence -c src/log.ml
- ocamlc.opt -w +L -w +R -w +Z -I src -I +unix -safe-string -bin-annot -strict-sequence -c src/shell.mli
- ocamlc.opt -w +L -w +R -w +Z -I src -I +unix -safe-string -bin-annot -strict-sequence -c src/shell.ml
- ocamlc.opt -w +L -w +R -w +Z -I src -I +unix -safe-string -bin-annot -strict-sequence -c src/bool.mli
- ocamlc.opt -w +L -w +R -w +Z -I src -I +unix -safe-string -bin-annot -strict-sequence -c src/bool.ml
- ocamlc.opt -w +L -w +R -w +Z -I src -I +unix -safe-string -bin-annot -strict-sequence -c src/glob_ast.mli
- ocamlc.opt -w +L -w +R -w +Z -I src -I +unix -safe-string -bin-annot -strict-sequence -c src/glob_ast.ml
- ocamllex.opt src/glob_lexer.mll
- 55 states, 419 transitions, table size 2006 bytes
- ocamlc.opt -w +L -w +R -w +Z -I src -I +unix -safe-string -bin-annot -strict-sequence -c src/glob_lexer.mli
- ocamlc.opt -w +L -w +R -w +Z -I src -I +unix -safe-string -bin-annot -strict-sequence -c src/glob_lexer.ml
- ocamlc.opt -w +L -w +R -w +Z -I src -I +unix -safe-string -bin-annot -strict-sequence -c src/glob.mli
- ocamlc.opt -w +L -w +R -w +Z -I src -I +unix -safe-string -bin-annot -strict-sequence -c src/glob.ml
- ocamllex.opt src/lexers.mll
- 251 states, 1051 transitions, table size 5710 bytes
- 4334 additional bytes used for bindings
- ocamlc.opt -w +L -w +R -w +Z -I src -I +unix -safe-string -bin-annot -strict-sequence -c src/lexers.mli
- ocamlc.opt -w +L -w +R -w +Z -I src -I +unix -safe-string -bin-annot -strict-sequence -c src/lexers.ml
- ocamlc.opt -w +L -w +R -w +Z -I src -I +unix -safe-string -bin-annot -strict-sequence -c src/param_tags.mli
- ocamlc.opt -w +L -w +R -w +Z -I src -I +unix -safe-string -bin-annot -strict-sequence -c src/param_tags.ml
- ocamlc.opt -w +L -w +R -w +Z -I src -I +unix -safe-string -bin-annot -strict-sequence -c src/command.mli
- ocamlc.opt -w +L -w +R -w +Z -I src -I +unix -safe-string -bin-annot -strict-sequence -c src/command.ml
- ocamlc.opt -w +L -w +R -w +Z -I src -I +unix -safe-string -bin-annot -strict-sequence -c src/ocamlbuild_config.ml
- ocamlc.opt -w +L -w +R -w +Z -I src -I +unix -safe-string -bin-annot -strict-sequence -c src/ocamlbuild_where.mli
- ocamlc.opt -w +L -w +R -w +Z -I src -I +unix -safe-string -bin-annot -strict-sequence -c src/ocamlbuild_where.ml
- ocamlc.opt -w +L -w +R -w +Z -I src -I +unix -safe-string -bin-annot -strict-sequence -c src/slurp.mli
- ocamlc.opt -w +L -w +R -w +Z -I src -I +unix -safe-string -bin-annot -strict-sequence -c src/slurp.ml
- ocamlc.opt -w +L -w +R -w +Z -I src -I +unix -safe-string -bin-annot -strict-sequence -c src/options.mli
- ocamlc.opt -w +L -w +R -w +Z -I src -I +unix -safe-string -bin-annot -strict-sequence -c src/options.ml
- ocamlc.opt -w +L -w +R -w +Z -I src -I +unix -safe-string -bin-annot -strict-sequence -c src/pathname.mli
- ocamlc.opt -w +L -w +R -w +Z -I src -I +unix -safe-string -bin-annot -strict-sequence -c src/pathname.ml
- ocamlc.opt -w +L -w +R -w +Z -I src -I +unix -safe-string -bin-annot -strict-sequence -c src/configuration.mli
- ocamlc.opt -w +L -w +R -w +Z -I src -I +unix -safe-string -bin-annot -strict-sequence -c src/configuration.ml
- ocamlc.opt -w +L -w +R -w +Z -I src -I +unix -safe-string -bin-annot -strict-sequence -c src/flags.mli
- ocamlc.opt -w +L -w +R -w +Z -I src -I +unix -safe-string -bin-annot -strict-sequence -c src/flags.ml
- ocamlc.opt -w +L -w +R -w +Z -I src -I +unix -safe-string -bin-annot -strict-sequence -c src/hygiene.mli
- ocamlc.opt -w +L -w +R -w +Z -I src -I +unix -safe-string -bin-annot -strict-sequence -c src/hygiene.ml
- ocamlc.opt -w +L -w +R -w +Z -I src -I +unix -safe-string -bin-annot -strict-sequence -c src/digest_cache.mli
- ocamlc.opt -w +L -w +R -w +Z -I src -I +unix -safe-string -bin-annot -strict-sequence -c src/digest_cache.ml
- ocamlc.opt -w +L -w +R -w +Z -I src -I +unix -safe-string -bin-annot -strict-sequence -c src/resource.mli
- ocamlc.opt -w +L -w +R -w +Z -I src -I +unix -safe-string -bin-annot -strict-sequence -c src/resource.ml
- ocamlc.opt -w +L -w +R -w +Z -I src -I +unix -safe-string -bin-annot -strict-sequence -c src/rule.mli
- ocamlc.opt -w +L -w +R -w +Z -I src -I +unix -safe-string -bin-annot -strict-sequence -c src/rule.ml
- ocamlc.opt -w +L -w +R -w +Z -I src -I +unix -safe-string -bin-annot -strict-sequence -c src/solver.mli
- ocamlc.opt -w +L -w +R -w +Z -I src -I +unix -safe-string -bin-annot -strict-sequence -c src/solver.ml
- ocamlc.opt -w +L -w +R -w +Z -I src -I +unix -safe-string -bin-annot -strict-sequence -c src/report.mli
- ocamlc.opt -w +L -w +R -w +Z -I src -I +unix -safe-string -bin-annot -strict-sequence -c src/report.ml
- ocamlc.opt -w +L -w +R -w +Z -I src -I +unix -safe-string -bin-annot -strict-sequence -c src/tools.mli
- ocamlc.opt -w +L -w +R -w +Z -I src -I +unix -safe-string -bin-annot -strict-sequence -c src/tools.ml
- ocamlc.opt -w +L -w +R -w +Z -I src -I +unix -safe-string -bin-annot -strict-sequence -c src/fda.mli
- ocamlc.opt -w +L -w +R -w +Z -I src -I +unix -safe-string -bin-annot -strict-sequence -c src/fda.ml
- ocamlc.opt -w +L -w +R -w +Z -I src -I +unix -safe-string -bin-annot -strict-sequence -c src/findlib.mli
- ocamlc.opt -w +L -w +R -w +Z -I src -I +unix -safe-string -bin-annot -strict-sequence -c src/findlib.ml
- ocamlc.opt -w +L -w +R -w +Z -I src -I +unix -safe-string -bin-annot -strict-sequence -c src/ocaml_arch.mli
- ocamlc.opt -w +L -w +R -w +Z -I src -I +unix -safe-string -bin-annot -strict-sequence -c src/ocaml_arch.ml
- ocamlc.opt -w +L -w +R -w +Z -I src -I +unix -safe-string -bin-annot -strict-sequence -c src/ocaml_utils.mli
- ocamlc.opt -w +L -w +R -w +Z -I src -I +unix -safe-string -bin-annot -strict-sequence -c src/ocaml_utils.ml
- ocamlc.opt -w +L -w +R -w +Z -I src -I +unix -safe-string -bin-annot -strict-sequence -c src/ocaml_dependencies.mli
- ocamlc.opt -w +L -w +R -w +Z -I src -I +unix -safe-string -bin-annot -strict-sequence -c src/ocaml_dependencies.ml
- ocamlc.opt -w +L -w +R -w +Z -I src -I +unix -safe-string -bin-annot -strict-sequence -c src/ocaml_compiler.mli
- ocamlc.opt -w +L -w +R -w +Z -I src -I +unix -safe-string -bin-annot -strict-sequence -c src/ocaml_compiler.ml
- ocamlc.opt -w +L -w +R -w +Z -I src -I +unix -safe-string -bin-annot -strict-sequence -c src/ocaml_tools.mli
- ocamlc.opt -w +L -w +R -w +Z -I src -I +unix -safe-string -bin-annot -strict-sequence -c src/ocaml_tools.ml
- ocamlc.opt -w +L -w +R -w +Z -I src -I +unix -safe-string -bin-annot -strict-sequence -c src/ocaml_specific.mli
- ocamlc.opt -w +L -w +R -w +Z -I src -I +unix -safe-string -bin-annot -strict-sequence -c src/ocaml_specific.ml
- ocamlc.opt -w +L -w +R -w +Z -I src -I +unix -safe-string -bin-annot -strict-sequence -c src/exit_codes.mli
- ocamlc.opt -w +L -w +R -w +Z -I src -I +unix -safe-string -bin-annot -strict-sequence -c src/exit_codes.ml
- ocamlc.opt -w +L -w +R -w +Z -I src -I +unix -safe-string -bin-annot -strict-sequence -c src/plugin.mli
- ocamlc.opt -w +L -w +R -w +Z -I src -I +unix -safe-string -bin-annot -strict-sequence -c src/plugin.ml
- ocamlc.opt -w +L -w +R -w +Z -I src -I +unix -safe-string -bin-annot -strict-sequence -c src/hooks.mli
- ocamlc.opt -w +L -w +R -w +Z -I src -I +unix -safe-string -bin-annot -strict-sequence -c src/hooks.ml
- ocamlc.opt -w +L -w +R -w +Z -I src -I +unix -safe-string -bin-annot -strict-sequence -c src/main.mli
- ocamlc.opt -w +L -w +R -w +Z -I src -I +unix -safe-string -bin-annot -strict-sequence -c src/main.ml
- mkdir -p tmp
- ocamlc.opt -pack src/const.cmo src/loc.cmo src/discard_printf.cmo src/signatures.cmi src/my_std.cmo src/my_unix.cmo src/tags.cmo src/display.cmo src/log.cmo src/shell.cmo src/bool.cmo src/glob_ast.cmo src/glob_lexer.cmo src/glob.cmo src/lexers.cmo src/param_tags.cmo src/command.cmo src/ocamlbuild_config.cmo src/ocamlbuild_where.cmo src/slurp.cmo src/options.cmo src/pathname.cmo src/configuration.cmo src/flags.cmo src/hygiene.cmo src/digest_cache.cmo src/resource.cmo src/rule.cmo src/solver.cmo src/report.cmo src/tools.cmo src/fda.cmo src/findlib.cmo src/ocaml_arch.cmo src/ocaml_utils.cmo src/ocaml_dependencies.cmo src/ocaml_compiler.cmo src/ocaml_tools.cmo src/ocaml_specific.cmo src/exit_codes.cmo src/plugin.cmo src/hooks.cmo src/main.cmo -o tmp/ocamlbuild_pack.cmo
- mv tmp/ocamlbuild_pack.cmi src/ocamlbuild_pack.cmi
- mv tmp/ocamlbuild_pack.cmo src/ocamlbuild_pack.cmo
- ocamlc.opt -w +L -w +R -w +Z -I src -I +unix -safe-string -bin-annot -strict-sequence -c src/ocamlbuild_plugin.mli
- ocamlc.opt -w +L -w +R -w +Z -I src -I +unix -safe-string -bin-annot -strict-sequence -c src/ocamlbuild_plugin.ml
- ocamlc.opt -w +L -w +R -w +Z -I src -I +unix -safe-string -bin-annot -strict-sequence -c src/ocamlbuild_executor.mli
- ocamlc.opt -w +L -w +R -w +Z -I src -I +unix -safe-string -bin-annot -strict-sequence -c src/ocamlbuild_executor.ml
- ocamlc.opt -w +L -w +R -w +Z -I src -I +unix -safe-string -bin-annot -strict-sequence -c src/ocamlbuild_unix_plugin.mli
- ocamlc.opt -w +L -w +R -w +Z -I src -I +unix -safe-string -bin-annot -strict-sequence -c src/ocamlbuild_unix_plugin.ml
- ocamlc.opt -w +L -w +R -w +Z -I src -I +unix -safe-string -bin-annot -strict-sequence -c src/ocamlbuild.mli
- ocamlc.opt -w +L -w +R -w +Z -I src -I +unix -safe-string -bin-annot -strict-sequence -c src/ocamlbuild.ml
- ocamlc.opt -I +unix -I src -o ocamlbuild.byte unix.cma src/ocamlbuild_pack.cmo src/ocamlbuild_plugin.cmo src/ocamlbuild_executor.cmo src/ocamlbuild_unix_plugin.cmo src/ocamlbuild.cmo
- ocamlc.opt -a -o src/ocamlbuildlib.cma src/ocamlbuild_pack.cmo src/ocamlbuild_plugin.cmo src/ocamlbuild_executor.cmo src/ocamlbuild_unix_plugin.cmo
- ocamlopt.opt -for-pack Ocamlbuild_pack -w +L -w +R -w +Z -I src -I +unix -safe-string -bin-annot -strict-sequence -c src/const.ml
- ocamlopt.opt -for-pack Ocamlbuild_pack -w +L -w +R -w +Z -I src -I +unix -safe-string -bin-annot -strict-sequence -c src/loc.ml
- ocamlopt.opt -for-pack Ocamlbuild_pack -w +L -w +R -w +Z -I src -I +unix -safe-string -bin-annot -strict-sequence -c src/discard_printf.ml
- ocamlopt.opt -for-pack Ocamlbuild_pack -w +L -w +R -w +Z -I src -I +unix -safe-string -bin-annot -strict-sequence -c src/my_std.ml
- ocamlopt.opt -for-pack Ocamlbuild_pack -w +L -w +R -w +Z -I src -I +unix -safe-string -bin-annot -strict-sequence -c src/my_unix.ml
- ocamlopt.opt -for-pack Ocamlbuild_pack -w +L -w +R -w +Z -I src -I +unix -safe-string -bin-annot -strict-sequence -c src/tags.ml
- ocamlopt.opt -for-pack Ocamlbuild_pack -w +L -w +R -w +Z -I src -I +unix -safe-string -bin-annot -strict-sequence -c src/display.ml
- ocamlopt.opt -for-pack Ocamlbuild_pack -w +L -w +R -w +Z -I src -I +unix -safe-string -bin-annot -strict-sequence -c src/log.ml
- ocamlopt.opt -for-pack Ocamlbuild_pack -w +L -w +R -w +Z -I src -I +unix -safe-string -bin-annot -strict-sequence -c src/shell.ml
- ocamlopt.opt -for-pack Ocamlbuild_pack -w +L -w +R -w +Z -I src -I +unix -safe-string -bin-annot -strict-sequence -c src/bool.ml
- ocamlopt.opt -for-pack Ocamlbuild_pack -w +L -w +R -w +Z -I src -I +unix -safe-string -bin-annot -strict-sequence -c src/glob_ast.ml
- ocamlopt.opt -for-pack Ocamlbuild_pack -w +L -w +R -w +Z -I src -I +unix -safe-string -bin-annot -strict-sequence -c src/glob_lexer.ml
- ocamlopt.opt -for-pack Ocamlbuild_pack -w +L -w +R -w +Z -I src -I +unix -safe-string -bin-annot -strict-sequence -c src/glob.ml
- ocamlopt.opt -for-pack Ocamlbuild_pack -w +L -w +R -w +Z -I src -I +unix -safe-string -bin-annot -strict-sequence -c src/lexers.ml
- ocamlopt.opt -for-pack Ocamlbuild_pack -w +L -w +R -w +Z -I src -I +unix -safe-string -bin-annot -strict-sequence -c src/param_tags.ml
- ocamlopt.opt -for-pack Ocamlbuild_pack -w +L -w +R -w +Z -I src -I +unix -safe-string -bin-annot -strict-sequence -c src/command.ml
- ocamlopt.opt -for-pack Ocamlbuild_pack -w +L -w +R -w +Z -I src -I +unix -safe-string -bin-annot -strict-sequence -c src/ocamlbuild_config.ml
- ocamlopt.opt -for-pack Ocamlbuild_pack -w +L -w +R -w +Z -I src -I +unix -safe-string -bin-annot -strict-sequence -c src/ocamlbuild_where.ml
- ocamlopt.opt -for-pack Ocamlbuild_pack -w +L -w +R -w +Z -I src -I +unix -safe-string -bin-annot -strict-sequence -c src/slurp.ml
- ocamlopt.opt -for-pack Ocamlbuild_pack -w +L -w +R -w +Z -I src -I +unix -safe-string -bin-annot -strict-sequence -c src/options.ml
- ocamlopt.opt -for-pack Ocamlbuild_pack -w +L -w +R -w +Z -I src -I +unix -safe-string -bin-annot -strict-sequence -c src/pathname.ml
- ocamlopt.opt -for-pack Ocamlbuild_pack -w +L -w +R -w +Z -I src -I +unix -safe-string -bin-annot -strict-sequence -c src/configuration.ml
- ocamlopt.opt -for-pack Ocamlbuild_pack -w +L -w +R -w +Z -I src -I +unix -safe-string -bin-annot -strict-sequence -c src/flags.ml
- ocamlopt.opt -for-pack Ocamlbuild_pack -w +L -w +R -w +Z -I src -I +unix -safe-string -bin-annot -strict-sequence -c src/hygiene.ml
- ocamlopt.opt -for-pack Ocamlbuild_pack -w +L -w +R -w +Z -I src -I +unix -safe-string -bin-annot -strict-sequence -c src/digest_cache.ml
- ocamlopt.opt -for-pack Ocamlbuild_pack -w +L -w +R -w +Z -I src -I +unix -safe-string -bin-annot -strict-sequence -c src/resource.ml
- ocamlopt.opt -for-pack Ocamlbuild_pack -w +L -w +R -w +Z -I src -I +unix -safe-string -bin-annot -strict-sequence -c src/rule.ml
- ocamlopt.opt -for-pack Ocamlbuild_pack -w +L -w +R -w +Z -I src -I +unix -safe-string -bin-annot -strict-sequence -c src/solver.ml
- ocamlopt.opt -for-pack Ocamlbuild_pack -w +L -w +R -w +Z -I src -I +unix -safe-string -bin-annot -strict-sequence -c src/report.ml
- ocamlopt.opt -for-pack Ocamlbuild_pack -w +L -w +R -w +Z -I src -I +unix -safe-string -bin-annot -strict-sequence -c src/tools.ml
- ocamlopt.opt -for-pack Ocamlbuild_pack -w +L -w +R -w +Z -I src -I +unix -safe-string -bin-annot -strict-sequence -c src/fda.ml
- ocamlopt.opt -for-pack Ocamlbuild_pack -w +L -w +R -w +Z -I src -I +unix -safe-string -bin-annot -strict-sequence -c src/findlib.ml
- ocamlopt.opt -for-pack Ocamlbuild_pack -w +L -w +R -w +Z -I src -I +unix -safe-string -bin-annot -strict-sequence -c src/ocaml_arch.ml
- ocamlopt.opt -for-pack Ocamlbuild_pack -w +L -w +R -w +Z -I src -I +unix -safe-string -bin-annot -strict-sequence -c src/ocaml_utils.ml
- ocamlopt.opt -for-pack Ocamlbuild_pack -w +L -w +R -w +Z -I src -I +unix -safe-string -bin-annot -strict-sequence -c src/ocaml_dependencies.ml
- ocamlopt.opt -for-pack Ocamlbuild_pack -w +L -w +R -w +Z -I src -I +unix -safe-string -bin-annot -strict-sequence -c src/ocaml_compiler.ml
- ocamlopt.opt -for-pack Ocamlbuild_pack -w +L -w +R -w +Z -I src -I +unix -safe-string -bin-annot -strict-sequence -c src/ocaml_tools.ml
- ocamlopt.opt -for-pack Ocamlbuild_pack -w +L -w +R -w +Z -I src -I +unix -safe-string -bin-annot -strict-sequence -c src/ocaml_specific.ml
- ocamlopt.opt -for-pack Ocamlbuild_pack -w +L -w +R -w +Z -I src -I +unix -safe-string -bin-annot -strict-sequence -c src/exit_codes.ml
- ocamlopt.opt -for-pack Ocamlbuild_pack -w +L -w +R -w +Z -I src -I +unix -safe-string -bin-annot -strict-sequence -c src/plugin.ml
- ocamlopt.opt -for-pack Ocamlbuild_pack -w +L -w +R -w +Z -I src -I +unix -safe-string -bin-annot -strict-sequence -c src/hooks.ml
- ocamlopt.opt -for-pack Ocamlbuild_pack -w +L -w +R -w +Z -I src -I +unix -safe-string -bin-annot -strict-sequence -c src/main.ml
- mkdir -p tmp
- ocamlopt.opt -pack src/const.cmx src/loc.cmx src/discard_printf.cmx src/signatures.cmi src/my_std.cmx src/my_unix.cmx src/tags.cmx src/display.cmx src/log.cmx src/shell.cmx src/bool.cmx src/glob_ast.cmx src/glob_lexer.cmx src/glob.cmx src/lexers.cmx src/param_tags.cmx src/command.cmx src/ocamlbuild_config.cmx src/ocamlbuild_where.cmx src/slurp.cmx src/options.cmx src/pathname.cmx src/configuration.cmx src/flags.cmx src/hygiene.cmx src/digest_cache.cmx src/resource.cmx src/rule.cmx src/solver.cmx src/report.cmx src/tools.cmx src/fda.cmx src/findlib.cmx src/ocaml_arch.cmx src/ocaml_utils.cmx src/ocaml_dependencies.cmx src/ocaml_compiler.cmx src/ocaml_tools.cmx src/ocaml_specific.cmx src/exit_codes.cmx src/plugin.cmx src/hooks.cmx src/main.cmx -o tmp/ocamlbuild_pack.cmx
- mv tmp/ocamlbuild_pack.cmx src/ocamlbuild_pack.cmx
- mv tmp/ocamlbuild_pack.o src/ocamlbuild_pack.o
- ocamlopt.opt -for-pack Ocamlbuild_pack -w +L -w +R -w +Z -I src -I +unix -safe-string -bin-annot -strict-sequence -c src/ocamlbuild_plugin.ml
- ocamlopt.opt -for-pack Ocamlbuild_pack -w +L -w +R -w +Z -I src -I +unix -safe-string -bin-annot -strict-sequence -c src/ocamlbuild_executor.ml
- ocamlopt.opt -for-pack Ocamlbuild_pack -w +L -w +R -w +Z -I src -I +unix -safe-string -bin-annot -strict-sequence -c src/ocamlbuild_unix_plugin.ml
- ocamlopt.opt -for-pack Ocamlbuild_pack -w +L -w +R -w +Z -I src -I +unix -safe-string -bin-annot -strict-sequence -c src/ocamlbuild.ml
- ocamlopt.opt -I +unix -I src -o ocamlbuild.native unix.cmxa src/ocamlbuild_pack.cmx src/ocamlbuild_plugin.cmx src/ocamlbuild_executor.cmx src/ocamlbuild_unix_plugin.cmx src/ocamlbuild.cmx
- ocamlopt.opt -a -o src/ocamlbuildlib.cmxa src/ocamlbuild_pack.cmx src/ocamlbuild_plugin.cmx src/ocamlbuild_executor.cmx src/ocamlbuild_unix_plugin.cmx
- ocamlc.opt src/ocamlbuild_pack.cmo -I src man/options_man.ml -o man/options_man.byte
- ./man/options_man.byte > man/ocamlbuild.options.1
- cat man/ocamlbuild.header.1 man/ocamlbuild.options.1 man/ocamlbuild.footer.1 > man/ocamlbuild.1
- /usr/bin/make ocamlbuild.install
- make[1]: Entering directory '/home/opam/.opam/4.12/.opam-switch/build/ocamlbuild.0.14.1'
- rm -f ocamlbuild.install
- touch ocamlbuild.install
- /usr/bin/make install-bin-opam
- make[2]: Entering directory '/home/opam/.opam/4.12/.opam-switch/build/ocamlbuild.0.14.1'
- echo 'bin: [' >> ocamlbuild.install
- echo '  "ocamlbuild.byte" {"ocamlbuild.byte"}' >> ocamlbuild.install
- echo '  "ocamlbuild.native" {"ocamlbuild.native"}' >> ocamlbuild.install
- echo '  "ocamlbuild.native" {"ocamlbuild"}' >> ocamlbuild.install
- echo ']' >> ocamlbuild.install
- echo >> ocamlbuild.install
- make[2]: Leaving directory '/home/opam/.opam/4.12/.opam-switch/build/ocamlbuild.0.14.1'
- /usr/bin/make install-lib-opam
- make[2]: Entering directory '/home/opam/.opam/4.12/.opam-switch/build/ocamlbuild.0.14.1'
- echo 'lib: [' >> ocamlbuild.install
- /usr/bin/make install-lib-basics-opam
- make[3]: Entering directory '/home/opam/.opam/4.12/.opam-switch/build/ocamlbuild.0.14.1'
- echo '  "ocamlbuild.opam" {"opam"}' >> ocamlbuild.install
- echo '  "META"' >> ocamlbuild.install
- for lib in src/signatures.mli src/signatures.cmi src/signatures.cmti; do \
-   echo "  \"$lib\" {\"$(basename $lib)\"}" >> ocamlbuild.install; \
- done
- make[3]: Leaving directory '/home/opam/.opam/4.12/.opam-switch/build/ocamlbuild.0.14.1'
- /usr/bin/make install-lib-byte-opam
- make[3]: Entering directory '/home/opam/.opam/4.12/.opam-switch/build/ocamlbuild.0.14.1'
- for lib in src/ocamlbuildlib.cma src/ocamlbuild.cmo src/ocamlbuild_pack.cmi src/ocamlbuild_plugin.cmi src/ocamlbuild_executor.cmi src/ocamlbuild_unix_plugin.cmi; do \
-   echo "  \"$lib\" {\"$(basename $lib)\"}" >> ocamlbuild.install; \
- done
- make[3]: Leaving directory '/home/opam/.opam/4.12/.opam-switch/build/ocamlbuild.0.14.1'
- /usr/bin/make install-lib-native-opam
- make[3]: Entering directory '/home/opam/.opam/4.12/.opam-switch/build/ocamlbuild.0.14.1'
- for lib in src/ocamlbuildlib.cmxa src/ocamlbuildlib.a src/ocamlbuild.cmx src/ocamlbuild.o src/ocamlbuild_pack.cmx src/ocamlbuild_plugin.cmx src/ocamlbuild_executor.cmx src/ocamlbuild_unix_plugin.cmx src/ocamlbuild_plugin.o src/ocamlbuild_executor.o src/ocamlbuild_unix_plugin.o; do \
-   echo "  \"$lib\" {\"$(basename $lib)\"}" >> ocamlbuild.install; \
- done
- make[3]: Leaving directory '/home/opam/.opam/4.12/.opam-switch/build/ocamlbuild.0.14.1'
- echo ']' >> ocamlbuild.install
- echo >> ocamlbuild.install
- make[2]: Leaving directory '/home/opam/.opam/4.12/.opam-switch/build/ocamlbuild.0.14.1'
- /usr/bin/make install-man-opam
- make[2]: Entering directory '/home/opam/.opam/4.12/.opam-switch/build/ocamlbuild.0.14.1'
- echo 'man: [' >> ocamlbuild.install
- echo '  "man/ocamlbuild.1" {"man1/ocamlbuild.1"}' >> ocamlbuild.install
- echo ']' >> ocamlbuild.install
- echo >> ocamlbuild.install
- make[2]: Leaving directory '/home/opam/.opam/4.12/.opam-switch/build/ocamlbuild.0.14.1'
- /usr/bin/make install-doc-opam
- make[2]: Entering directory '/home/opam/.opam/4.12/.opam-switch/build/ocamlbuild.0.14.1'
- echo 'doc: [' >> ocamlbuild.install
- echo '  "LICENSE"' >> ocamlbuild.install
- echo '  "Changes"' >> ocamlbuild.install
- echo '  "Readme.md"' >> ocamlbuild.install
- echo ']' >> ocamlbuild.install
- make[2]: Leaving directory '/home/opam/.opam/4.12/.opam-switch/build/ocamlbuild.0.14.1'
- make[1]: Leaving directory '/home/opam/.opam/4.12/.opam-switch/build/ocamlbuild.0.14.1'
-> compiled  ocamlbuild.0.14.1
Processing 81/153: [stog-writing.0.19.0: http] [gen: dune build] [lwt: dune exec] [menhir: dune build] [ordering: rm] [re: dune build] [result: dune build] [sexplib0: dune build] [stdlib-shims: dune build]
-> installed ocamlbuild.0.14.1
Processing 82/153: [stog-writing.0.19.0: http] [gen: dune build] [lwt: dune exec] [menhir: dune build] [ordering: rm] [re: dune build] [result: dune build] [sexplib0: dune build] [stdlib-shims: dune build]
-> compiled  result.1.5
Processing 82/153: [stog-writing.0.19.0: http] [gen: dune build] [lwt: dune exec] [menhir: dune build] [ordering: rm] [re: dune build] [sexplib0: dune build] [stdlib-shims: dune build]
-> installed result.1.5
Processing 83/153: [stog-writing.0.19.0: http] [gen: dune build] [lwt: dune exec] [menhir: dune build] [ordering: rm] [re: dune build] [sexplib0: dune build] [stdlib-shims: dune build]
Processing 84/153: [stog-writing.0.19.0: http] [angstrom: dune build] [gen: dune build] [lwt: dune exec] [menhir: dune build] [ordering: rm] [re: dune build] [sexplib0: dune build] [stdlib-shims: dune build]
-> compiled  re.1.10.4
Processing 84/153: [stog-writing.0.19.0: http] [angstrom: dune build] [gen: dune build] [lwt: dune exec] [menhir: dune build] [ordering: rm] [sexplib0: dune build] [stdlib-shims: dune build]
-> installed re.1.10.4
Processing 85/153: [stog-writing.0.19.0: http] [angstrom: dune build] [gen: dune build] [lwt: dune exec] [menhir: dune build] [ordering: rm] [sexplib0: dune build] [stdlib-shims: dune build]
-> retrieved stdune.3.4.1  (cached)
Processing 86/153: [stog-writing.0.19.0: http] [angstrom: dune build] [gen: dune build] [lwt: dune exec] [menhir: dune build] [ordering: rm] [sexplib0: dune build] [stdlib-shims: dune build]
-> compiled  sexplib0.v0.15.1
Processing 86/153: [stog-writing.0.19.0: http] [angstrom: dune build] [gen: dune build] [lwt: dune exec] [menhir: dune build] [ordering: rm] [stdlib-shims: dune build]
-> installed sexplib0.v0.15.1
Processing 87/153: [stog-writing.0.19.0: http] [angstrom: dune build] [gen: dune build] [lwt: dune exec] [menhir: dune build] [ordering: rm] [stdlib-shims: dune build]
-> retrieved stog.0.20.0  (cached)
Processing 88/153: [stog-writing.0.19.0: http] [angstrom: dune build] [gen: dune build] [lwt: dune exec] [menhir: dune build] [ordering: rm] [stdlib-shims: dune build]
-> compiled  stdlib-shims.0.3.0
Processing 88/153: [stog-writing.0.19.0: http] [angstrom: dune build] [gen: dune build] [lwt: dune exec] [menhir: dune build] [ordering: rm]
-> installed stdlib-shims.0.3.0
Processing 89/153: [stog-writing.0.19.0: http] [angstrom: dune build] [gen: dune build] [lwt: dune exec] [menhir: dune build] [ordering: rm]
Processing 90/153: [stog-writing.0.19.0: http] [angstrom: dune build] [gen: dune build] [lwt: dune exec] [menhir: dune build] [ordering: rm] [ppxlib: dune build]
-> compiled  gen.1.0
Processing 90/153: [stog-writing.0.19.0: http] [angstrom: dune build] [lwt: dune exec] [menhir: dune build] [ordering: rm] [ppxlib: dune build]
-> installed gen.1.0
Processing 91/153: [stog-writing.0.19.0: http] [angstrom: dune build] [lwt: dune exec] [menhir: dune build] [ordering: rm] [ppxlib: dune build]
Processing 91/153: [stog-writing.0.19.0: http] [angstrom: dune build] [lwt: dune build] [menhir: dune build] [ordering: rm] [ppxlib: dune build]
Processing 91/153: [angstrom: dune build] [lwt: dune build] [menhir: dune build] [ordering: rm] [ppxlib: dune build]
-> compiled  angstrom.0.15.0
Processing 91/153: [lwt: dune build] [menhir: dune build] [ordering: rm] [ppxlib: dune build]
-> installed angstrom.0.15.0
Processing 92/153: [lwt: dune build] [menhir: dune build] [ordering: rm] [ppxlib: dune build]
-> retrieved stringext.1.6.0  (cached)
Processing 93/153: [lwt: dune build] [menhir: dune build] [ordering: rm] [ppxlib: dune build]
Processing 94/153: [lwt: dune build] [menhir: dune build] [ordering: rm] [ppxlib: dune build] [stringext: dune build]
-> retrieved topkg.1.0.5  (cached)
Processing 95/153: [lwt: dune build] [menhir: dune build] [ordering: rm] [ppxlib: dune build] [stringext: dune build]
Processing 96/153: [lwt: dune build] [menhir: dune build] [ordering: rm] [ppxlib: dune build] [stringext: dune build] [topkg: ocaml build]
-> retrieved stog-writing.0.19.0  (https://framagit.org/zoggy/old-codes/-/archive/stog-writing-0.19.0/old-codes-stog-writing-0.19.0.tar.gz)
Processing 97/153: [lwt: dune build] [menhir: dune build] [ordering: rm] [ppxlib: dune build] [stringext: dune build] [topkg: ocaml build]
Processing 97/153: [lwt: dune build] [menhir: dune build] [ordering: dune build] [ppxlib: dune build] [stringext: dune build] [topkg: ocaml build]
-> retrieved uchar.0.0.2  (cached)
Processing 98/153: [lwt: dune build] [menhir: dune build] [ordering: dune build] [ppxlib: dune build] [stringext: dune build] [topkg: ocaml build]
Processing 99/153: [lwt: dune build] [menhir: dune build] [ordering: dune build] [ppxlib: dune build] [stringext: dune build] [topkg: ocaml build] [uchar: ocaml]
-> retrieved uri.4.2.0  (cached)
Processing 100/153: [lwt: dune build] [menhir: dune build] [ordering: dune build] [ppxlib: dune build] [stringext: dune build] [topkg: ocaml build] [uchar: ocaml]
-> retrieved uunf.14.0.0  (cached)
Processing 101/153: [lwt: dune build] [menhir: dune build] [ordering: dune build] [ppxlib: dune build] [stringext: dune build] [topkg: ocaml build] [uchar: ocaml]
-> retrieved uutf.1.0.3  (cached)
Processing 102/153: [lwt: dune build] [menhir: dune build] [ordering: dune build] [ppxlib: dune build] [stringext: dune build] [topkg: ocaml build] [uchar: ocaml]
-> retrieved xtmpl.0.19.0  (cached)
-> retrieved xtmpl_ppx.0.19.0  (cached)
-> retrieved yojson.2.0.2  (cached)
Processing 103/153: [lwt: dune build] [menhir: dune build] [ordering: dune build] [ppxlib: dune build] [stringext: dune build] [topkg: ocaml build] [uchar: ocaml] [yojson: dune build]
-> compiled  stringext.1.6.0
Processing 103/153: [lwt: dune build] [menhir: dune build] [ordering: dune build] [ppxlib: dune build] [topkg: ocaml build] [uchar: ocaml] [yojson: dune build]
-> installed stringext.1.6.0
Processing 104/153: [lwt: dune build] [menhir: dune build] [ordering: dune build] [ppxlib: dune build] [topkg: ocaml build] [uchar: ocaml] [yojson: dune build]
Processing 105/153: [lwt: dune build] [menhir: dune build] [ordering: dune build] [ppxlib: dune build] [topkg: ocaml build] [uchar: ocaml] [uri: dune build] [yojson: dune build]
-> compiled  uchar.0.0.2
Processing 105/153: [lwt: dune build] [menhir: dune build] [ordering: dune build] [ppxlib: dune build] [topkg: ocaml build] [uri: dune build] [yojson: dune build]
-> installed uchar.0.0.2
Processing 106/153: [lwt: dune build] [menhir: dune build] [ordering: dune build] [ppxlib: dune build] [topkg: ocaml build] [uri: dune build] [yojson: dune build]
-> compiled  ordering.3.4.1
Processing 106/153: [lwt: dune build] [menhir: dune build] [ppxlib: dune build] [topkg: ocaml build] [uri: dune build] [yojson: dune build]
-> installed ordering.3.4.1
Processing 107/153: [lwt: dune build] [menhir: dune build] [ppxlib: dune build] [topkg: ocaml build] [uri: dune build] [yojson: dune build]
Processing 108/153: [dyn: rm] [lwt: dune build] [menhir: dune build] [ppxlib: dune build] [topkg: ocaml build] [uri: dune build] [yojson: dune build]
-> compiled  yojson.2.0.2
Processing 108/153: [dyn: rm] [lwt: dune build] [menhir: dune build] [ppxlib: dune build] [topkg: ocaml build] [uri: dune build]
-> installed yojson.2.0.2
Processing 109/153: [dyn: rm] [lwt: dune build] [menhir: dune build] [ppxlib: dune build] [topkg: ocaml build] [uri: dune build]
Processing 110/153: [dyn: rm] [lwt: dune build] [menhir: dune build] [ocf: dune build] [ppxlib: dune build] [topkg: ocaml build] [uri: dune build]
-> compiled  uri.4.2.0
Processing 110/153: [dyn: rm] [lwt: dune build] [menhir: dune build] [ocf: dune build] [ppxlib: dune build] [topkg: ocaml build]
-> installed uri.4.2.0
Processing 111/153: [dyn: rm] [lwt: dune build] [menhir: dune build] [ocf: dune build] [ppxlib: dune build] [topkg: ocaml build]
Processing 111/153: [dyn: dune build] [lwt: dune build] [menhir: dune build] [ocf: dune build] [ppxlib: dune build] [topkg: ocaml build]
Processing 111/153: [dyn: dune build] [lwt: dune build] [menhir: dune build] [ocf: dune install] [ppxlib: dune build] [topkg: ocaml build]
- Copying to _destdir/home/opam/.opam/4.12/lib/ocf/META
- Copying to _destdir/home/opam/.opam/4.12/lib/ocf/dune-package
-> compiled  ocf.0.8.0
Processing 111/153: [dyn: dune build] [lwt: dune build] [menhir: dune build] [ppxlib: dune build] [topkg: ocaml build]
-> installed ocf.0.8.0
Processing 112/153: [dyn: dune build] [lwt: dune build] [menhir: dune build] [ppxlib: dune build] [topkg: ocaml build]
-> compiled  lwt.5.6.1
Processing 112/153: [dyn: dune build] [menhir: dune build] [ppxlib: dune build] [topkg: ocaml build]
-> installed lwt.5.6.1
Processing 113/153: [dyn: dune build] [menhir: dune build] [ppxlib: dune build] [topkg: ocaml build]
-> compiled  dyn.3.4.1
Processing 113/153: [menhir: dune build] [ppxlib: dune build] [topkg: ocaml build]
-> installed dyn.3.4.1
Processing 114/153: [menhir: dune build] [ppxlib: dune build] [topkg: ocaml build]
Processing 115/153: [menhir: dune build] [ppxlib: dune build] [stdune: rm] [topkg: ocaml build]
Processing 115/153: [menhir: dune build] [ppxlib: dune build] [stdune: dune build] [topkg: ocaml build]
- ocamlfind ocamldep -modules src/topkg.ml > src/topkg.ml.depends
- ocamlfind ocamldep -modules src/topkg.mli > src/topkg.mli.depends
- ocamlfind ocamlc -c -g -bin-annot -safe-string -I src -I test -I src-care -I src-bin -o src/topkg.cmi src/topkg.mli
- ocamlfind ocamldep -modules src/topkg_build.ml > src/topkg_build.ml.depends
- ocamlfind ocamldep -modules src/topkg_build.mli > src/topkg_build.mli.depends
- ocamlfind ocamldep -modules src/topkg_cmd.mli > src/topkg_cmd.mli.depends
- ocamlfind ocamldep -modules src/topkg_fpath.mli > src/topkg_fpath.mli.depends
- ocamlfind ocamlc -c -g -bin-annot -safe-string -I src -I test -I src-care -I src-bin -o src/topkg_fpath.cmi src/topkg_fpath.mli
- ocamlfind ocamldep -modules src/topkg_codec.mli > src/topkg_codec.mli.depends
- ocamlfind ocamlc -c -g -bin-annot -safe-string -I src -I test -I src-care -I src-bin -o src/topkg_cmd.cmi src/topkg_cmd.mli
- ocamlfind ocamldep -modules src/topkg_result.mli > src/topkg_result.mli.depends
- ocamlfind ocamlc -c -g -bin-annot -safe-string -I src -I test -I src-care -I src-bin -o src/topkg_result.cmi src/topkg_result.mli
- ocamlfind ocamldep -modules src/topkg_conf.mli > src/topkg_conf.mli.depends
- ocamlfind ocamlc -c -g -bin-annot -safe-string -I src -I test -I src-care -I src-bin -o src/topkg_codec.cmi src/topkg_codec.mli
- ocamlfind ocamlc -c -g -bin-annot -safe-string -I src -I test -I src-care -I src-bin -o src/topkg_conf.cmi src/topkg_conf.mli
- ocamlfind ocamlc -c -g -bin-annot -safe-string -I src -I test -I src-care -I src-bin -o src/topkg_build.cmi src/topkg_build.mli
- ocamlfind ocamldep -modules src/topkg_cmd.ml > src/topkg_cmd.ml.depends
- ocamlfind ocamldep -modules src/topkg_fpath.ml > src/topkg_fpath.ml.depends
- ocamlfind ocamldep -modules src/topkg_string.ml > src/topkg_string.ml.depends
- ocamlfind ocamldep -modules src/topkg_string.mli > src/topkg_string.mli.depends
- ocamlfind ocamlc -c -g -bin-annot -safe-string -I src -I test -I src-care -I src-bin -o src/topkg_string.cmi src/topkg_string.mli
- ocamlfind ocamlopt -c -g -bin-annot -safe-string -I src -I test -I src-care -I src-bin -o src/topkg_string.cmx src/topkg_string.ml
- ocamlfind ocamlopt -c -g -bin-annot -safe-string -I src -I test -I src-care -I src-bin -o src/topkg_fpath.cmx src/topkg_fpath.ml
- ocamlfind ocamldep -modules src/topkg_codec.ml > src/topkg_codec.ml.depends
- ocamlfind ocamlopt -c -g -bin-annot -safe-string -I src -I test -I src-care -I src-bin -o src/topkg_cmd.cmx src/topkg_cmd.ml
- ocamlfind ocamldep -modules src/topkg_os.ml > src/topkg_os.ml.depends
- ocamlfind ocamldep -modules src/topkg_os.mli > src/topkg_os.mli.depends
- ocamlfind ocamlc -c -g -bin-annot -safe-string -I src -I test -I src-care -I src-bin -o src/topkg_os.cmi src/topkg_os.mli
- ocamlfind ocamldep -modules src/topkg_log.ml > src/topkg_log.ml.depends
- ocamlfind ocamldep -modules src/topkg_log.mli > src/topkg_log.mli.depends
- ocamlfind ocamlc -c -g -bin-annot -safe-string -I src -I test -I src-care -I src-bin -o src/topkg_log.cmi src/topkg_log.mli
- ocamlfind ocamldep -modules src/topkg_result.ml > src/topkg_result.ml.depends
- ocamlfind ocamlopt -c -g -bin-annot -safe-string -I src -I test -I src-care -I src-bin -o src/topkg_result.cmx src/topkg_result.ml
- ocamlfind ocamlopt -c -g -bin-annot -safe-string -I src -I test -I src-care -I src-bin -o src/topkg_log.cmx src/topkg_log.ml
- ocamlfind ocamlopt -c -g -bin-annot -safe-string -I src -I test -I src-care -I src-bin -o src/topkg_os.cmx src/topkg_os.ml
- ocamlfind ocamldep -modules src/topkg_conf.ml > src/topkg_conf.ml.depends
- ocamlfind ocamlopt -c -g -bin-annot -safe-string -I src -I test -I src-care -I src-bin -o src/topkg_codec.cmx src/topkg_codec.ml
- ocamlfind ocamldep -modules src/topkg_vcs.ml > src/topkg_vcs.ml.depends
- ocamlfind ocamldep -modules src/topkg_vcs.mli > src/topkg_vcs.mli.depends
- ocamlfind ocamlc -c -g -bin-annot -safe-string -I src -I test -I src-care -I src-bin -o src/topkg_vcs.cmi src/topkg_vcs.mli
- ocamlfind ocamlopt -c -g -bin-annot -safe-string -I src -I test -I src-care -I src-bin -o src/topkg_vcs.cmx src/topkg_vcs.ml
- ocamlfind ocamlopt -c -g -bin-annot -safe-string -I src -I test -I src-care -I src-bin -o src/topkg_conf.cmx src/topkg_conf.ml
- ocamlfind ocamldep -modules src/topkg_distrib.ml > src/topkg_distrib.ml.depends
- ocamlfind ocamldep -modules src/topkg_distrib.mli > src/topkg_distrib.mli.depends
- ocamlfind ocamlc -c -g -bin-annot -safe-string -I src -I test -I src-care -I src-bin -o src/topkg_distrib.cmi src/topkg_distrib.mli
- ocamlfind ocamldep -modules src/topkg_opam.ml > src/topkg_opam.ml.depends
- ocamlfind ocamldep -modules src/topkg_opam.mli > src/topkg_opam.mli.depends
- ocamlfind ocamlc -c -g -bin-annot -safe-string -I src -I test -I src-care -I src-bin -o src/topkg_opam.cmi src/topkg_opam.mli
- ocamlfind ocamlopt -c -g -bin-annot -safe-string -I src -I test -I src-care -I src-bin -o src/topkg_opam.cmx src/topkg_opam.ml
- ocamlfind ocamldep -modules src/topkg_fexts.ml > src/topkg_fexts.ml.depends
- ocamlfind ocamldep -modules src/topkg_fexts.mli > src/topkg_fexts.mli.depends
- ocamlfind ocamlc -c -g -bin-annot -safe-string -I src -I test -I src-care -I src-bin -o src/topkg_fexts.cmi src/topkg_fexts.mli
- ocamlfind ocamldep -modules src/topkg_install.ml > src/topkg_install.ml.depends
- ocamlfind ocamldep -modules src/topkg_install.mli > src/topkg_install.mli.depends
- ocamlfind ocamldep -modules src/topkg_test.mli > src/topkg_test.mli.depends
- ocamlfind ocamlc -c -g -bin-annot -safe-string -I src -I test -I src-care -I src-bin -o src/topkg_test.cmi src/topkg_test.mli
- ocamlfind ocamlc -c -g -bin-annot -safe-string -I src -I test -I src-care -I src-bin -o src/topkg_install.cmi src/topkg_install.mli
- ocamlfind ocamlopt -c -g -bin-annot -safe-string -I src -I test -I src-care -I src-bin -o src/topkg_fexts.cmx src/topkg_fexts.ml
- ocamlfind ocamldep -modules src/topkg_test.ml > src/topkg_test.ml.depends
- ocamlfind ocamlopt -c -g -bin-annot -safe-string -I src -I test -I src-care -I src-bin -o src/topkg_test.cmx src/topkg_test.ml
- ocamlfind ocamldep -modules src/topkg_ipc.ml > src/topkg_ipc.ml.depends
- ocamlfind ocamldep -modules src/topkg_ipc.mli > src/topkg_ipc.mli.depends
- ocamlfind ocamldep -modules src/topkg_pkg.mli > src/topkg_pkg.mli.depends
- ocamlfind ocamldep -modules src/topkg_publish.mli > src/topkg_publish.mli.depends
- ocamlfind ocamlc -c -g -bin-annot -safe-string -I src -I test -I src-care -I src-bin -o src/topkg_publish.cmi src/topkg_publish.mli
- ocamlfind ocamlc -c -g -bin-annot -safe-string -I src -I test -I src-care -I src-bin -o src/topkg_pkg.cmi src/topkg_pkg.mli
- ocamlfind ocamlc -c -g -bin-annot -safe-string -I src -I test -I src-care -I src-bin -o src/topkg_ipc.cmi src/topkg_ipc.mli
- ocamlfind ocamldep -modules src/topkg_pkg.ml > src/topkg_pkg.ml.depends
- ocamlfind ocamlopt -c -g -bin-annot -safe-string -I src -I test -I src-care -I src-bin -o src/topkg_build.cmx src/topkg_build.ml
- ocamlfind ocamlopt -c -g -bin-annot -safe-string -I src -I test -I src-care -I src-bin -o src/topkg_distrib.cmx src/topkg_distrib.ml
- ocamlfind ocamlopt -c -g -bin-annot -safe-string -I src -I test -I src-care -I src-bin -o src/topkg_install.cmx src/topkg_install.ml
- ocamlfind ocamldep -modules src/topkg_publish.ml > src/topkg_publish.ml.depends
- ocamlfind ocamlopt -c -g -bin-annot -safe-string -I src -I test -I src-care -I src-bin -o src/topkg_publish.cmx src/topkg_publish.ml
- ocamlfind ocamlopt -c -g -bin-annot -safe-string -I src -I test -I src-care -I src-bin -o src/topkg_pkg.cmx src/topkg_pkg.ml
- ocamlfind ocamldep -modules src/topkg_main.ml > src/topkg_main.ml.depends
- ocamlfind ocamldep -modules src/topkg_main.mli > src/topkg_main.mli.depends
- ocamlfind ocamlc -c -g -bin-annot -safe-string -I src -I test -I src-care -I src-bin -o src/topkg_main.cmi src/topkg_main.mli
- ocamlfind ocamlopt -c -g -bin-annot -safe-string -I src -I test -I src-care -I src-bin -o src/topkg_ipc.cmx src/topkg_ipc.ml
- ocamlfind ocamlopt -c -g -bin-annot -safe-string -I src -I test -I src-care -I src-bin -o src/topkg_main.cmx src/topkg_main.ml
- ocamlfind ocamlopt -c -g -bin-annot -safe-string -I src -I test -I src-care -I src-bin -o src/topkg.cmx src/topkg.ml
- ocamlfind ocamlopt -a -I src src/topkg_string.cmx src/topkg_fpath.cmx src/topkg_cmd.cmx src/topkg_result.cmx src/topkg_log.cmx src/topkg_os.cmx src/topkg_codec.cmx src/topkg_vcs.cmx src/topkg_conf.cmx src/topkg_build.cmx src/topkg_opam.cmx src/topkg_distrib.cmx src/topkg_fexts.cmx src/topkg_test.cmx src/topkg_install.cmx src/topkg_publish.cmx src/topkg_pkg.cmx src/topkg_ipc.cmx src/topkg_main.cmx src/topkg.cmx -o src/topkg.cmxa
- ocamlfind ocamlopt -shared -linkall -I src src/topkg.cmxa -o src/topkg.cmxs
- ocamlfind ocamlc -c -g -bin-annot -safe-string -I src -I test -I src-care -I src-bin -o src/topkg.cmo src/topkg.ml
- ocamlfind ocamlc -c -g -bin-annot -safe-string -I src -I test -I src-care -I src-bin -o src/topkg_build.cmo src/topkg_build.ml
- ocamlfind ocamlc -c -g -bin-annot -safe-string -I src -I test -I src-care -I src-bin -o src/topkg_cmd.cmo src/topkg_cmd.ml
- ocamlfind ocamlc -c -g -bin-annot -safe-string -I src -I test -I src-care -I src-bin -o src/topkg_codec.cmo src/topkg_codec.ml
- ocamlfind ocamlc -c -g -bin-annot -safe-string -I src -I test -I src-care -I src-bin -o src/topkg_conf.cmo src/topkg_conf.ml
- ocamlfind ocamlc -c -g -bin-annot -safe-string -I src -I test -I src-care -I src-bin -o src/topkg_distrib.cmo src/topkg_distrib.ml
- ocamlfind ocamlc -c -g -bin-annot -safe-string -I src -I test -I src-care -I src-bin -o src/topkg_fexts.cmo src/topkg_fexts.ml
- ocamlfind ocamlc -c -g -bin-annot -safe-string -I src -I test -I src-care -I src-bin -o src/topkg_fpath.cmo src/topkg_fpath.ml
- ocamlfind ocamlc -c -g -bin-annot -safe-string -I src -I test -I src-care -I src-bin -o src/topkg_install.cmo src/topkg_install.ml
- ocamlfind ocamlc -c -g -bin-annot -safe-string -I src -I test -I src-care -I src-bin -o src/topkg_ipc.cmo src/topkg_ipc.ml
- ocamlfind ocamlc -c -g -bin-annot -safe-string -I src -I test -I src-care -I src-bin -o src/topkg_log.cmo src/topkg_log.ml
- ocamlfind ocamlc -c -g -bin-annot -safe-string -I src -I test -I src-care -I src-bin -o src/topkg_main.cmo src/topkg_main.ml
- ocamlfind ocamlc -c -g -bin-annot -safe-string -I src -I test -I src-care -I src-bin -o src/topkg_opam.cmo src/topkg_opam.ml
- ocamlfind ocamlc -c -g -bin-annot -safe-string -I src -I test -I src-care -I src-bin -o src/topkg_os.cmo src/topkg_os.ml
- ocamlfind ocamlc -c -g -bin-annot -safe-string -I src -I test -I src-care -I src-bin -o src/topkg_pkg.cmo src/topkg_pkg.ml
- ocamlfind ocamlc -c -g -bin-annot -safe-string -I src -I test -I src-care -I src-bin -o src/topkg_publish.cmo src/topkg_publish.ml
- ocamlfind ocamlc -c -g -bin-annot -safe-string -I src -I test -I src-care -I src-bin -o src/topkg_result.cmo src/topkg_result.ml
- ocamlfind ocamlc -c -g -bin-annot -safe-string -I src -I test -I src-care -I src-bin -o src/topkg_string.cmo src/topkg_string.ml
- ocamlfind ocamlc -c -g -bin-annot -safe-string -I src -I test -I src-care -I src-bin -o src/topkg_test.cmo src/topkg_test.ml
- ocamlfind ocamlc -c -g -bin-annot -safe-string -I src -I test -I src-care -I src-bin -o src/topkg_vcs.cmo src/topkg_vcs.ml
- ocamlfind ocamlc -a -I src src/topkg_string.cmo src/topkg_fpath.cmo src/topkg_cmd.cmo src/topkg_result.cmo src/topkg_log.cmo src/topkg_os.cmo src/topkg_codec.cmo src/topkg_vcs.cmo src/topkg_conf.cmo src/topkg_build.cmo src/topkg_opam.cmo src/topkg_distrib.cmo src/topkg_fexts.cmo src/topkg_test.cmo src/topkg_install.cmo src/topkg_publish.cmo src/topkg_pkg.cmo src/topkg_ipc.cmo src/topkg_main.cmo src/topkg.cmo -o src/topkg.cma
- # Parallel statistics: { count(total): 2(84), max: 20, min: 2, average(total): 11.000(1.238) }
-> compiled  topkg.1.0.5
Processing 115/153: [menhir: dune build] [ppxlib: dune build] [stdune: dune build]
-> installed topkg.1.0.5
Processing 116/153: [menhir: dune build] [ppxlib: dune build] [stdune: dune build]
Processing 117/153: [fmt: ocaml build] [menhir: dune build] [ppxlib: dune build] [stdune: dune build]
Processing 118/153: [fmt: ocaml build] [menhir: dune build] [ppxlib: dune build] [ptime: ocaml build] [stdune: dune build]
Processing 119/153: [fmt: ocaml build] [menhir: dune build] [ppxlib: dune build] [ptime: ocaml build] [stdune: dune build] [uutf: ocaml build]
- ocamlfind ocamldep -modules src/uutf.ml > src/uutf.ml.depends
- ocamlfind ocamldep -modules src/uutf.mli > src/uutf.mli.depends
- ocamlfind ocamlc -c -g -bin-annot -safe-string -I src -I test -o src/uutf.cmi src/uutf.mli
- ocamlfind ocamlopt -c -g -bin-annot -safe-string -I src -I test -o src/uutf.cmx src/uutf.ml
- ocamlfind ocamlopt -a -I src src/uutf.cmx -o src/uutf.cmxa
- ocamlfind ocamlopt -shared -linkall -I src src/uutf.cmxa -o src/uutf.cmxs
- ocamlfind ocamlc -c -g -bin-annot -safe-string -I src -I test -o src/uutf.cmo src/uutf.ml
- ocamlfind ocamlc -a -I src src/uutf.cmo -o src/uutf.cma
- # No parallelism done
-> compiled  uutf.1.0.3
Processing 119/153: [fmt: ocaml build] [menhir: dune build] [ppxlib: dune build] [ptime: ocaml build] [stdune: dune build]
-> installed uutf.1.0.3
Processing 120/153: [fmt: ocaml build] [menhir: dune build] [ppxlib: dune build] [ptime: ocaml build] [stdune: dune build]
Processing 121/153: [fmt: ocaml build] [menhir: dune build] [ppxlib: dune build] [ptime: ocaml build] [stdune: dune build] [uunf: ocaml build]
- ocamlfind ocamldep -modules src/fmt.ml > src/fmt.ml.depends
- ocamlfind ocamldep -modules src/fmt.mli > src/fmt.mli.depends
- ocamlfind ocamlc -c -g -bin-annot -safe-string -I src -I test -o src/fmt.cmi src/fmt.mli
- ocamlfind ocamlopt -c -g -bin-annot -safe-string -I src -I test -o src/fmt.cmx src/fmt.ml
- ocamlfind ocamlopt -a -I src src/fmt.cmx -o src/fmt.cmxa
- ocamlfind ocamlopt -shared -linkall -I src src/fmt.cmxa -o src/fmt.cmxs
- ocamlfind ocamlc -c -g -bin-annot -safe-string -I src -I test -o src/fmt.cmo src/fmt.ml
- ocamlfind ocamlc -a -I src src/fmt.cmo -o src/fmt.cma
- ocamlfind ocamldep -package unix -modules src/fmt_tty.ml > src/fmt_tty.ml.depends
- ocamlfind ocamldep -package unix -modules src/fmt_tty.mli > src/fmt_tty.mli.depends
- ocamlfind ocamlc -c -g -bin-annot -safe-string -package unix -I src -I test -o src/fmt_tty.cmi src/fmt_tty.mli
- ocamlfind ocamlopt -c -g -bin-annot -safe-string -package unix -I src -I test -o src/fmt_tty.cmx src/fmt_tty.ml
- ocamlfind ocamlopt -a -package unix -I src src/fmt_tty.cmx -o src/fmt_tty.cmxa
- ocamlfind ocamlopt -shared -linkall -package unix -I src src/fmt_tty.cmxa -o src/fmt_tty.cmxs
- ocamlfind ocamlc -c -g -bin-annot -safe-string -package unix -I src -I test -o src/fmt_tty.cmo src/fmt_tty.ml
- ocamlfind ocamlc -a -package unix -I src src/fmt_tty.cmo -o src/fmt_tty.cma
- ocamlfind ocamldep -package compiler-libs.toplevel -modules src/fmt_top.ml > src/fmt_top.ml.depends
- ocamlfind ocamlc -c -g -bin-annot -safe-string -package compiler-libs.toplevel -I src -I test -o src/fmt_top.cmo src/fmt_top.ml
- + ocamlfind ocamlc -c -g -bin-annot -safe-string -package compiler-libs.toplevel -I src -I test -o src/fmt_top.cmo src/fmt_top.ml
- findlib: [WARNING] Interface topdirs.cmi occurs in several directories: /home/opam/.opam/4.12/lib/ocaml, /home/opam/.opam/4.12/lib/ocaml/compiler-libs
- ocamlfind ocamlopt -c -g -bin-annot -safe-string -package compiler-libs.toplevel -I src -I test -o src/fmt_top.cmx src/fmt_top.ml
- + ocamlfind ocamlopt -c -g -bin-annot -safe-string -package compiler-libs.toplevel -I src -I test -o src/fmt_top.cmx src/fmt_top.ml
- findlib: [WARNING] Interface topdirs.cmi occurs in several directories: /home/opam/.opam/4.12/lib/ocaml, /home/opam/.opam/4.12/lib/ocaml/compiler-libs
- File "_none_", line 1:
- Warning 58 [no-cmx-file]: no cmx file was found in path for module Toploop, and its interface was not compiled with -opaque
- ocamlfind ocamlopt -a -package compiler-libs.toplevel -I src src/fmt_top.cmx -o src/fmt_top.cmxa
- + ocamlfind ocamlopt -a -package compiler-libs.toplevel -I src src/fmt_top.cmx -o src/fmt_top.cmxa
- findlib: [WARNING] Interface topdirs.cmi occurs in several directories: /home/opam/.opam/4.12/lib/ocaml, /home/opam/.opam/4.12/lib/ocaml/compiler-libs
- ocamlfind ocamlopt -shared -linkall -package compiler-libs.toplevel -I src src/fmt_top.cmxa -o src/fmt_top.cmxs
- + ocamlfind ocamlopt -shared -linkall -package compiler-libs.toplevel -I src src/fmt_top.cmxa -o src/fmt_top.cmxs
- findlib: [WARNING] Interface topdirs.cmi occurs in several directories: /home/opam/.opam/4.12/lib/ocaml, /home/opam/.opam/4.12/lib/ocaml/compiler-libs
- ocamlfind ocamlc -a -package compiler-libs.toplevel -I src src/fmt_top.cmo -o src/fmt_top.cma
- + ocamlfind ocamlc -a -package compiler-libs.toplevel -I src src/fmt_top.cmo -o src/fmt_top.cma
- findlib: [WARNING] Interface topdirs.cmi occurs in several directories: /home/opam/.opam/4.12/lib/ocaml, /home/opam/.opam/4.12/lib/ocaml/compiler-libs
- # No parallelism done
-> compiled  fmt.0.9.0
Processing 121/153: [menhir: dune build] [ppxlib: dune build] [ptime: ocaml build] [stdune: dune build] [uunf: ocaml build]
-> installed fmt.0.9.0
Processing 122/153: [menhir: dune build] [ppxlib: dune build] [ptime: ocaml build] [stdune: dune build] [uunf: ocaml build]
Processing 123/153: [logs: ocaml build] [menhir: dune build] [ppxlib: dune build] [ptime: ocaml build] [stdune: dune build] [uunf: ocaml build]
- ocamlfind ocamlopt unix.cmxa -I /home/opam/.opam/4.12/lib/ocamlbuild /home/opam/.opam/4.12/lib/ocamlbuild/ocamlbuildlib.cmxa -linkpkg myocamlbuild.ml /home/opam/.opam/4.12/lib/ocamlbuild/ocamlbuild.cmx -o myocamlbuild
- ocamlfind ocamldep -modules src/ptime.ml > src/ptime.ml.depends
- ocamlfind ocamldep -modules src/ptime.mli > src/ptime.mli.depends
- ocamlfind ocamlc -c -g -bin-annot -safe-string -I src -I src-clock -o src/ptime.cmi src/ptime.mli
- ocamlfind ocamlopt -c -g -bin-annot -safe-string -I src -I src-clock -o src/ptime.cmx src/ptime.ml
- ocamlfind ocamlopt -a -I src src/ptime.cmx -o src/ptime.cmxa
- ocamlfind ocamlopt -shared -linkall -I src src/ptime.cmxa -o src/ptime.cmxs
- ocamlfind ocamlc -c -g -bin-annot -safe-string -I src -I src-clock -o src/ptime.cmo src/ptime.ml
- ocamlfind ocamlc -a -I src src/ptime.cmo -o src/ptime.cma
- ocamlfind ocamldep -package compiler-libs.toplevel -modules src/ptime_top.ml > src/ptime_top.ml.depends
- ocamlfind ocamlc -c -g -bin-annot -safe-string -package compiler-libs.toplevel -I src -I src-clock -o src/ptime_top.cmo src/ptime_top.ml
- + ocamlfind ocamlc -c -g -bin-annot -safe-string -package compiler-libs.toplevel -I src -I src-clock -o src/ptime_top.cmo src/ptime_top.ml
- findlib: [WARNING] Interface topdirs.cmi occurs in several directories: /home/opam/.opam/4.12/lib/ocaml, /home/opam/.opam/4.12/lib/ocaml/compiler-libs
- ocamlfind ocamlopt -c -g -bin-annot -safe-string -package compiler-libs.toplevel -I src -I src-clock -o src/ptime_top.cmx src/ptime_top.ml
- + ocamlfind ocamlopt -c -g -bin-annot -safe-string -package compiler-libs.toplevel -I src -I src-clock -o src/ptime_top.cmx src/ptime_top.ml
- findlib: [WARNING] Interface topdirs.cmi occurs in several directories: /home/opam/.opam/4.12/lib/ocaml, /home/opam/.opam/4.12/lib/ocaml/compiler-libs
- File "_none_", line 1:
- Warning 58 [no-cmx-file]: no cmx file was found in path for module Toploop, and its interface was not compiled with -opaque
- ocamlfind ocamlopt -a -package compiler-libs.toplevel -I src src/ptime_top.cmx -o src/ptime_top.cmxa
- + ocamlfind ocamlopt -a -package compiler-libs.toplevel -I src src/ptime_top.cmx -o src/ptime_top.cmxa
- findlib: [WARNING] Interface topdirs.cmi occurs in several directories: /home/opam/.opam/4.12/lib/ocaml, /home/opam/.opam/4.12/lib/ocaml/compiler-libs
- ocamlfind ocamlopt -shared -linkall -package compiler-libs.toplevel -I src src/ptime_top.cmxa -o src/ptime_top.cmxs
- + ocamlfind ocamlopt -shared -linkall -package compiler-libs.toplevel -I src src/ptime_top.cmxa -o src/ptime_top.cmxs
- findlib: [WARNING] Interface topdirs.cmi occurs in several directories: /home/opam/.opam/4.12/lib/ocaml, /home/opam/.opam/4.12/lib/ocaml/compiler-libs
- ocamlfind ocamlc -a -package compiler-libs.toplevel -I src src/ptime_top.cmo -o src/ptime_top.cma
- + ocamlfind ocamlc -a -package compiler-libs.toplevel -I src src/ptime_top.cmo -o src/ptime_top.cma
- findlib: [WARNING] Interface topdirs.cmi occurs in several directories: /home/opam/.opam/4.12/lib/ocaml, /home/opam/.opam/4.12/lib/ocaml/compiler-libs
- ocamlfind ocamldep -modules src/ptime_clock.mli > src/ptime_clock.mli.depends
- ocamlfind ocamlc -c -g -bin-annot -safe-string -I src -I src-clock -o src/ptime_clock.cmi src/ptime_clock.mli
- ocamlfind ocamlc -g -c src-clock/ptime_clock_stubs.c
- mv ptime_clock_stubs.o src-clock/ptime_clock_stubs.o
- ocamlfind ocamlmklib -o src-clock/ptime_clock_stubs -g src-clock/ptime_clock_stubs.o
- ocamlfind ocamldep -modules src-clock/ptime_clock.ml > src-clock/ptime_clock.ml.depends
- ocamlfind ocamldep -modules src-clock/ptime_clock.mli > src-clock/ptime_clock.mli.depends
- ocamlfind ocamlc -c -g -bin-annot -safe-string -I src-clock -I src -o src-clock/ptime_clock.cmi src-clock/ptime_clock.mli
- ocamlfind ocamlopt -c -g -bin-annot -safe-string -I src-clock -I src -o src-clock/ptime_clock.cmx src-clock/ptime_clock.ml
- + ocamlfind ocamlopt -c -g -bin-annot -safe-string -I src-clock -I src -o src-clock/ptime_clock.cmx src-clock/ptime_clock.ml
- findlib: [WARNING] Interface ptime_clock.cmi occurs in several directories: src, src-clock
- ocamlfind ocamlopt -a -cclib -lptime_clock_stubs -cclib -lrt -I src-clock src-clock/ptime_clock.cmx -o src-clock/ptime_clock.cmxa
- ocamlfind ocamlopt -shared -linkall src-clock/libptime_clock_stubs.a -I src-clock src-clock/ptime_clock.cmxa -o src-clock/ptime_clock.cmxs
- ocamlfind ocamlc -c -g -bin-annot -safe-string -I src-clock -I src -o src-clock/ptime_clock.cmo src-clock/ptime_clock.ml
- + ocamlfind ocamlc -c -g -bin-annot -safe-string -I src-clock -I src -o src-clock/ptime_clock.cmo src-clock/ptime_clock.ml
- findlib: [WARNING] Interface ptime_clock.cmi occurs in several directories: src, src-clock
- ocamlfind ocamlc -a -dllib -lptime_clock_stubs -cclib -lrt -cclib -lptime_clock_stubs -cclib -lrt -I src-clock src-clock/ptime_clock.cmo -o src-clock/ptime_clock.cma
- # No parallelism done
-> compiled  ptime.1.0.0
Processing 123/153: [logs: ocaml build] [menhir: dune build] [ppxlib: dune build] [stdune: dune build] [uunf: ocaml build]
-> installed ptime.1.0.0
Processing 124/153: [logs: ocaml build] [menhir: dune build] [ppxlib: dune build] [stdune: dune build] [uunf: ocaml build]
- ocamlfind ocamldep -modules src/logs.ml > src/logs.ml.depends
- ocamlfind ocamldep -modules src/logs.mli > src/logs.mli.depends
- ocamlfind ocamlc -c -g -bin-annot -safe-string -I src -I test -o src/logs.cmi src/logs.mli
- ocamlfind ocamlopt -c -g -bin-annot -safe-string -I src -I test -o src/logs.cmx src/logs.ml
- ocamlfind ocamlopt -a -I src src/logs.cmx -o src/logs.cmxa
- ocamlfind ocamlopt -shared -linkall -I src src/logs.cmxa -o src/logs.cmxs
- ocamlfind ocamlc -c -g -bin-annot -safe-string -I src -I test -o src/logs.cmo src/logs.ml
- ocamlfind ocamlc -a -I src src/logs.cmo -o src/logs.cma
- ocamlfind ocamldep -package fmt -modules src/logs_fmt.ml > src/logs_fmt.ml.depends
- ocamlfind ocamldep -package fmt -modules src/logs_fmt.mli > src/logs_fmt.mli.depends
- ocamlfind ocamlc -c -g -bin-annot -safe-string -package fmt -I src -I test -o src/logs_fmt.cmi src/logs_fmt.mli
- ocamlfind ocamlopt -c -g -bin-annot -safe-string -package fmt -I src -I test -o src/logs_fmt.cmx src/logs_fmt.ml
- ocamlfind ocamlopt -a -package fmt -I src src/logs_fmt.cmx -o src/logs_fmt.cmxa
- ocamlfind ocamlopt -shared -linkall -package fmt -I src src/logs_fmt.cmxa -o src/logs_fmt.cmxs
- ocamlfind ocamlc -c -g -bin-annot -safe-string -package fmt -I src -I test -o src/logs_fmt.cmo src/logs_fmt.ml
- ocamlfind ocamlc -a -package fmt -I src src/logs_fmt.cmo -o src/logs_fmt.cma
- ocamlfind ocamldep -package lwt -modules src/logs_lwt.ml > src/logs_lwt.ml.depends
- ocamlfind ocamldep -package lwt -modules src/logs_lwt.mli > src/logs_lwt.mli.depends
- ocamlfind ocamlc -c -g -bin-annot -safe-string -package lwt -I src -I test -o src/logs_lwt.cmi src/logs_lwt.mli
- ocamlfind ocamlopt -c -g -bin-annot -safe-string -package lwt -I src -I test -o src/logs_lwt.cmx src/logs_lwt.ml
- ocamlfind ocamlopt -a -package lwt -I src src/logs_lwt.cmx -o src/logs_lwt.cmxa
- ocamlfind ocamlopt -shared -linkall -package lwt -I src src/logs_lwt.cmxa -o src/logs_lwt.cmxs
- ocamlfind ocamlc -c -g -bin-annot -safe-string -package lwt -I src -I test -o src/logs_lwt.cmo src/logs_lwt.ml
- ocamlfind ocamlc -a -package lwt -I src src/logs_lwt.cmo -o src/logs_lwt.cma
- ocamlfind ocamldep -package compiler-libs.toplevel -modules src/logs_top.ml > src/logs_top.ml.depends
- ocamlfind ocamlc -c -g -bin-annot -safe-string -package compiler-libs.toplevel -I src -I test -o src/logs_top.cmo src/logs_top.ml
- + ocamlfind ocamlc -c -g -bin-annot -safe-string -package compiler-libs.toplevel -I src -I test -o src/logs_top.cmo src/logs_top.ml
- findlib: [WARNING] Interface topdirs.cmi occurs in several directories: /home/opam/.opam/4.12/lib/ocaml, /home/opam/.opam/4.12/lib/ocaml/compiler-libs
- ocamlfind ocamlopt -c -g -bin-annot -safe-string -package compiler-libs.toplevel -I src -I test -o src/logs_top.cmx src/logs_top.ml
- + ocamlfind ocamlopt -c -g -bin-annot -safe-string -package compiler-libs.toplevel -I src -I test -o src/logs_top.cmx src/logs_top.ml
- findlib: [WARNING] Interface topdirs.cmi occurs in several directories: /home/opam/.opam/4.12/lib/ocaml, /home/opam/.opam/4.12/lib/ocaml/compiler-libs
- File "_none_", line 1:
- Warning 58 [no-cmx-file]: no cmx file was found in path for module Toploop, and its interface was not compiled with -opaque
- ocamlfind ocamlopt -a -package compiler-libs.toplevel -I src src/logs_top.cmx -o src/logs_top.cmxa
- + ocamlfind ocamlopt -a -package compiler-libs.toplevel -I src src/logs_top.cmx -o src/logs_top.cmxa
- findlib: [WARNING] Interface topdirs.cmi occurs in several directories: /home/opam/.opam/4.12/lib/ocaml, /home/opam/.opam/4.12/lib/ocaml/compiler-libs
- ocamlfind ocamlopt -shared -linkall -package compiler-libs.toplevel -I src src/logs_top.cmxa -o src/logs_top.cmxs
- + ocamlfind ocamlopt -shared -linkall -package compiler-libs.toplevel -I src src/logs_top.cmxa -o src/logs_top.cmxs
- findlib: [WARNING] Interface topdirs.cmi occurs in several directories: /home/opam/.opam/4.12/lib/ocaml, /home/opam/.opam/4.12/lib/ocaml/compiler-libs
- ocamlfind ocamlc -a -package compiler-libs.toplevel -I src src/logs_top.cmo -o src/logs_top.cma
- + ocamlfind ocamlc -a -package compiler-libs.toplevel -I src src/logs_top.cmo -o src/logs_top.cma
- findlib: [WARNING] Interface topdirs.cmi occurs in several directories: /home/opam/.opam/4.12/lib/ocaml, /home/opam/.opam/4.12/lib/ocaml/compiler-libs
- ocamlfind ocamldep -package threads -modules src/logs_threaded.ml > src/logs_threaded.ml.depends
- ocamlfind ocamldep -package threads -modules src/logs_threaded.mli > src/logs_threaded.mli.depends
- ocamlfind ocamlc -c -g -bin-annot -safe-string -thread -package threads -I src -I test -o src/logs_threaded.cmi src/logs_threaded.mli
- ocamlfind ocamlopt -c -g -bin-annot -safe-string -thread -package threads -I src -I test -o src/logs_threaded.cmx src/logs_threaded.ml
- ocamlfind ocamlopt -a -thread -package threads -I src src/logs_threaded.cmx -o src/logs_threaded.cmxa
- ocamlfind ocamlopt -shared -linkall -thread -package threads -I src src/logs_threaded.cmxa -o src/logs_threaded.cmxs
- ocamlfind ocamlc -c -g -bin-annot -safe-string -thread -package threads -I src -I test -o src/logs_threaded.cmo src/logs_threaded.ml
- ocamlfind ocamlc -a -thread -package threads -I src src/logs_threaded.cmo -o src/logs_threaded.cma
- # No parallelism done
-> compiled  logs.0.7.0
Processing 124/153: [menhir: dune build] [ppxlib: dune build] [stdune: dune build] [uunf: ocaml build]
-> installed logs.0.7.0
Processing 125/153: [menhir: dune build] [ppxlib: dune build] [stdune: dune build] [uunf: ocaml build]
-> compiled  stdune.3.4.1
Processing 125/153: [menhir: dune build] [ppxlib: dune build] [uunf: ocaml build]
-> installed stdune.3.4.1
Processing 126/153: [menhir: dune build] [ppxlib: dune build] [uunf: ocaml build]
Processing 127/153: [dune-private-libs: rm] [menhir: dune build] [ppxlib: dune build] [uunf: ocaml build]
- (cd _build/default/src/stage2 && .bin/menhir --exn-carries-state --no-pager --require-aliases --strict parser.mly --compare-errors parserMessages.auto.messages --compare-errors parserMessages.messages) > _build/default/src/stage2/parserMessages.check
- Read 101 sample input sentences and 101 error messages.
- Read 101 sample input sentences and 48 error messages.
- (cd _build/default && src/stage2/.bin/menhir --exn-carries-state --no-pager --require-aliases --strict -lg 1 -la 1 -lc 1 -v src/stage2/parser.mly --base src/stage2/parser --infer-read-reply src/stage2/parser__mock.mli.inferred)
- Grammar has 56 nonterminal symbols, among which 1 start symbols.
- Grammar has 37 terminal symbols.
- Grammar has 129 productions.
- Built an LR(0) automaton with 194 states.
- The grammar is not SLR(1) -- 5 states have a conflict.
- The construction mode is no-pager.
- Built an LR(1) automaton with 298 states.
- One shift/reduce conflict was silently solved.
- Extra reductions on error were added in 40 states.
- Priority played a role in 0 of these states.
- 152 out of 298 states have a default reduction.
- 102 out of 298 states are represented.
- 44 out of 96 symbols keep track of their start position.
- 41 out of 96 symbols keep track of their end position.
- 264 specialized copies of 64 functions have been created.
- The StackLang code contains 5161 instructions in 241 blocks.
- The StackLang code comprises 5 mutually recursive groups.
- (cd _build/default/src/stage2 && .bin/menhir --exn-carries-state --no-pager --require-aliases --strict parser.mly --compile-errors parserMessages.messages) > _build/default/src/stage2/parserMessages.ml
- Read 101 sample input sentences and 48 error messages.
-> compiled  menhir.20220210
Processing 127/153: [dune-private-libs: rm] [ppxlib: dune build] [uunf: ocaml build]
-> installed menhir.20220210
Processing 128/153: [dune-private-libs: rm] [ppxlib: dune build] [uunf: ocaml build]
Processing 128/153: [dune-private-libs: dune build] [ppxlib: dune build] [uunf: ocaml build]
-> compiled  dune-private-libs.3.4.1
Processing 128/153: [ppxlib: dune build] [uunf: ocaml build]
-> installed dune-private-libs.3.4.1
Processing 129/153: [ppxlib: dune build] [uunf: ocaml build]
Processing 130/153: [dune-site: rm] [ppxlib: dune build] [uunf: ocaml build]
Processing 130/153: [dune-site: dune build] [ppxlib: dune build] [uunf: ocaml build]
-> compiled  dune-site.3.4.1
Processing 130/153: [ppxlib: dune build] [uunf: ocaml build]
-> installed dune-site.3.4.1
Processing 131/153: [ppxlib: dune build] [uunf: ocaml build]
- ocamlfind ocamldep -modules src/uunf_fmt.ml > src/uunf_fmt.ml.depends
- ocamlfind ocamlc -c -g -bin-annot -safe-string -I src -I test -o src/uunf_fmt.cmo src/uunf_fmt.ml
- ocamlfind ocamldep -modules src/uunf_tmap.ml > src/uunf_tmap.ml.depends
- ocamlfind ocamlc -c -g -bin-annot -safe-string -I src -I test -o src/uunf_tmap.cmo src/uunf_tmap.ml
- ocamlfind ocamlopt -c -g -bin-annot -safe-string -I src -I test -o src/uunf_fmt.cmx src/uunf_fmt.ml
- ocamlfind ocamldep -modules src/uunf_tmapbool.ml > src/uunf_tmapbool.ml.depends
- ocamlfind ocamlc -c -g -bin-annot -safe-string -I src -I test -o src/uunf_tmapbool.cmo src/uunf_tmapbool.ml
- ocamlfind ocamldep -modules src/uunf_tmapbyte.ml > src/uunf_tmapbyte.ml.depends
- ocamlfind ocamlc -c -g -bin-annot -safe-string -I src -I test -o src/uunf_tmapbyte.cmo src/uunf_tmapbyte.ml
- ocamlfind ocamldep -modules src/uunf_data.ml > src/uunf_data.ml.depends
- ocamlfind ocamlc -c -g -bin-annot -safe-string -I src -I test -o src/uunf_data.cmo src/uunf_data.ml
- ocamlfind ocamlopt -c -g -bin-annot -safe-string -I src -I test -o src/uunf_tmap.cmx src/uunf_tmap.ml
- ocamlfind ocamlopt -c -g -bin-annot -safe-string -I src -I test -o src/uunf_tmapbool.cmx src/uunf_tmapbool.ml
- ocamlfind ocamlopt -c -g -bin-annot -safe-string -I src -I test -o src/uunf_tmapbyte.cmx src/uunf_tmapbyte.ml
- ocamlfind ocamldep -modules src/uunf.ml > src/uunf.ml.depends
- ocamlfind ocamldep -modules src/uunf.mli > src/uunf.mli.depends
- ocamlfind ocamlc -c -g -bin-annot -safe-string -I src -I test -o src/uunf.cmi src/uunf.mli
- ocamlfind ocamlopt -c -g -bin-annot -safe-string -I src -I test -o src/uunf_data.cmx src/uunf_data.ml
- ocamlfind ocamlopt -c -g -bin-annot -safe-string -I src -I test -o src/uunf.cmx src/uunf.ml
- ocamlfind ocamlopt -a -I src src/uunf_fmt.cmx src/uunf_tmap.cmx src/uunf_tmapbool.cmx src/uunf_tmapbyte.cmx src/uunf_data.cmx src/uunf.cmx -o src/uunf.cmxa
- ocamlfind ocamlopt -shared -linkall -I src src/uunf.cmxa -o src/uunf.cmxs
- ocamlfind ocamlc -c -g -bin-annot -safe-string -I src -I test -o src/uunf.cmo src/uunf.ml
- ocamlfind ocamlc -a -I src src/uunf_fmt.cmo src/uunf_tmap.cmo src/uunf_tmapbool.cmo src/uunf_tmapbyte.cmo src/uunf_data.cmo src/uunf.cmo -o src/uunf.cma
- ocamlfind ocamldep -package uutf -modules src/uunf_string.ml > src/uunf_string.ml.depends
- ocamlfind ocamldep -package uutf -modules src/uunf_string.mli > src/uunf_string.mli.depends
- ocamlfind ocamlc -c -g -bin-annot -safe-string -package uutf -I src -I test -o src/uunf_string.cmi src/uunf_string.mli
- ocamlfind ocamlopt -c -g -bin-annot -safe-string -package uutf -I src -I test -o src/uunf_string.cmx src/uunf_string.ml
- ocamlfind ocamlopt -a -package uutf -I src src/uunf_string.cmx -o src/uunf_string.cmxa
- ocamlfind ocamlopt -shared -linkall -package uutf -I src src/uunf_string.cmxa -o src/uunf_string.cmxs
- ocamlfind ocamlc -c -g -bin-annot -safe-string -package uutf -I src -I test -o src/uunf_string.cmo src/uunf_string.ml
- ocamlfind ocamlc -a -package uutf -I src src/uunf_string.cmo -o src/uunf_string.cma
- # No parallelism done
-> compiled  uunf.14.0.0
Processing 131/153: [ppxlib: dune build]
-> installed uunf.14.0.0
Processing 132/153: [ppxlib: dune build]
+ /home/opam/.opam/4.12/bin/dune "build" "-p" "ppxlib" "-j" "31" "@install" (CWD=/home/opam/.opam/4.12/.opam-switch/build/ppxlib.0.27.0)
-> compiled  ppxlib.0.27.0
-> installed ppxlib.0.27.0
Processing 134/153: [lwt_ppx: dune build]
Processing 135/153: [lwt_ppx: dune build] [ocf_ppx: dune build]
Processing 136/153: [lwt_ppx: dune build] [ocf_ppx: dune build] [ppx_blob: dune build]
Processing 137/153: [lwt_ppx: dune build] [ocf_ppx: dune build] [ppx_blob: dune build] [sedlex: dune build]
-> compiled  ppx_blob.0.7.2
Processing 137/153: [lwt_ppx: dune build] [ocf_ppx: dune build] [sedlex: dune build]
-> installed ppx_blob.0.7.2
Processing 138/153: [lwt_ppx: dune build] [ocf_ppx: dune build] [sedlex: dune build]
-> compiled  lwt_ppx.2.1.0
Processing 138/153: [ocf_ppx: dune build] [sedlex: dune build]
-> installed lwt_ppx.2.1.0
Processing 139/153: [ocf_ppx: dune build] [sedlex: dune build]
Processing 139/153: [ocf_ppx: dune install] [sedlex: dune build]
- Copying to _destdir/home/opam/.opam/4.12/lib/ocf_ppx/META
- Copying to _destdir/home/opam/.opam/4.12/lib/ocf_ppx/dune-package
-> compiled  ocf_ppx.0.8.0
Processing 139/153: [sedlex: dune build]
-> installed ocf_ppx.0.8.0
Processing 140/153: [sedlex: dune build]
+ /home/opam/.opam/4.12/bin/dune "build" "-p" "sedlex" "-j" "31" "@install" (CWD=/home/opam/.opam/4.12/.opam-switch/build/sedlex.3.0)
-> compiled  sedlex.3.0
-> installed sedlex.3.0
Processing 142/153: [iri: dune build]
+ /home/opam/.opam/4.12/bin/dune "build" "-p" "iri" "-j" "31" "--promote-install-files=false" "@install" (CWD=/home/opam/.opam/4.12/.opam-switch/build/iri.0.6.0)
Processing 142/153: [iri: dune install]
+ /home/opam/.opam/4.12/bin/dune "install" "-p" "iri" "--create-install-files" "iri" (CWD=/home/opam/.opam/4.12/.opam-switch/build/iri.0.6.0)
- Copying to _destdir/home/opam/.opam/4.12/lib/iri/META
- Copying to _destdir/home/opam/.opam/4.12/lib/iri/dune-package
-> compiled  iri.0.6.0
-> installed iri.0.6.0
Processing 144/153: [xtmpl: dune build]
+ /home/opam/.opam/4.12/bin/dune "build" "-p" "xtmpl" "-j" "31" "--promote-install-files=false" "@install" (CWD=/home/opam/.opam/4.12/.opam-switch/build/xtmpl.0.19.0)
Processing 144/153: [xtmpl: dune install]
+ /home/opam/.opam/4.12/bin/dune "install" "-p" "xtmpl" "--create-install-files" "xtmpl" (CWD=/home/opam/.opam/4.12/.opam-switch/build/xtmpl.0.19.0)
- Copying to _destdir/home/opam/.opam/4.12/lib/xtmpl/META
- Copying to _destdir/home/opam/.opam/4.12/lib/xtmpl/dune-package
-> compiled  xtmpl.0.19.0
-> installed xtmpl.0.19.0
Processing 146/153: [higlo: dune build]
Processing 147/153: [higlo: dune build] [xtmpl_ppx: dune build]
Processing 147/153: [higlo: dune install] [xtmpl_ppx: dune build]
- Copying to _destdir/home/opam/.opam/4.12/lib/higlo/META
- Copying to _destdir/home/opam/.opam/4.12/lib/higlo/dune-package
-> compiled  higlo.0.8
Processing 147/153: [xtmpl_ppx: dune build]
-> installed higlo.0.8
Processing 148/153: [xtmpl_ppx: dune build]
+ /home/opam/.opam/4.12/bin/dune "build" "-p" "xtmpl_ppx" "-j" "31" "--promote-install-files=false" "@install" (CWD=/home/opam/.opam/4.12/.opam-switch/build/xtmpl_ppx.0.19.0)
Processing 148/153: [xtmpl_ppx: dune install]
+ /home/opam/.opam/4.12/bin/dune "install" "-p" "xtmpl_ppx" "--create-install-files" "xtmpl_ppx" (CWD=/home/opam/.opam/4.12/.opam-switch/build/xtmpl_ppx.0.19.0)
- Copying to _destdir/home/opam/.opam/4.12/lib/xtmpl_ppx/META
- Copying to _destdir/home/opam/.opam/4.12/lib/xtmpl_ppx/dune-package
-> compiled  xtmpl_ppx.0.19.0
-> installed xtmpl_ppx.0.19.0
Processing 150/153: [stog: dune build]
+ /home/opam/.opam/4.12/bin/dune "build" "-p" "stog" "-j" "31" "--promote-install-files=false" "@install" (CWD=/home/opam/.opam/4.12/.opam-switch/build/stog.0.20.0)
- (cd _build/default && /home/opam/.opam/4.12/bin/menhir lib/filter_parser.mly --base lib/filter_parser --infer-read-reply lib/filter_parser__mock.mli.inferred)
- Warning: 3 states have shift/reduce conflicts.
- Warning: 6 shift/reduce conflicts were arbitrarily resolved.
Processing 150/153: [stog: dune install]
+ /home/opam/.opam/4.12/bin/dune "install" "-p" "stog" "--create-install-files" "stog" (CWD=/home/opam/.opam/4.12/.opam-switch/build/stog.0.20.0)
- Copying to _destdir/home/opam/.opam/4.12/lib/stog/Install.ml
- Copying to _destdir/home/opam/.opam/4.12/lib/stog/META
- Copying to _destdir/home/opam/.opam/4.12/lib/stog/dune-package
- Copying to _destdir/home/opam/.opam/4.12/lib/stog/stog.a
- Copying to _destdir/home/opam/.opam/4.12/lib/stog/stog.cma
- Copying to _destdir/home/opam/.opam/4.12/lib/stog/stog__Install.cmt
- Copying to _destdir/home/opam/.opam/4.12/lib/stog/stog.cmxs
- Copying to _destdir/home/opam/.opam/4.12/bin/latex2stog
- Copying to _destdir/home/opam/.opam/4.12/bin/stog
- Copying to _destdir/home/opam/.opam/4.12/bin/stog-tmpl
- Copying to _destdir/home/opam/.opam/4.12/bin/stog.byte
-> compiled  stog.0.20.0
-> installed stog.0.20.0
Processing 152/153: [stog-writing: make all]
+ /usr/bin/make "all" (CWD=/home/opam/.opam/4.12/.opam-switch/build/stog-writing.0.19.0)
- ocamlfind ocamlc -I +ocamldoc -g -annot -package menhirLib,xtmpl,stog,ocf -rectypes -c bibtex.mli
- findlib: [WARNING] Interface topdirs.cmi occurs in several directories: /home/opam/.opam/4.12/lib/ocaml/compiler-libs, /home/opam/.opam/4.12/lib/ocaml
- ocamlfind: [WARNING] Package `threads': Linking problems may arise because of the missing -thread or -vmthread switch
- menhir bib_parser.mly
- Warning: 5 end-of-stream conflicts were arbitrarily resolved.
- File "<standard.mly>", line 109, characters 18-18:
- Warning: production option(EOF) -> is never reduced.
- Warning: in total, 1 production is never reduced.
- Error: the code back-end requires the type of every nonterminal symbol to be
- known. Please specify the type of every symbol via %type declarations, or
- enable type inference (look up --infer in the manual).
- Type inference is automatically enabled when Menhir is used via Dune,
- provided the dune-project file says (using menhir 2.0) or later.
- The types of the following nonterminal symbols are unknown:
- entry
- field
- list(entry)
- list(field)
- option(COMMA)
- option(EOF)
- make: *** [Makefile:83: bib_parser.mli] Error 1
[ERROR] The compilation of stog-writing.0.19.0 failed at "make all".

#=== ERROR while compiling stog-writing.0.19.0 ================================#
# context              2.1.3 | linux/x86_64 | ocaml-base-compiler.4.12.1 | file:///src
# path                 ~/.opam/4.12/.opam-switch/build/stog-writing.0.19.0
# command              /usr/bin/make all
# exit-code            2
# env-file             ~/.opam/log/stog-writing-260-8ee4e7.env
# output-file          ~/.opam/log/stog-writing-260-8ee4e7.out
### output ###
# ocamlfind ocamlc -I +ocamldoc -g -annot -package menhirLib,xtmpl,stog,ocf -rectypes -c bibtex.mli
# findlib: [WARNING] Interface topdirs.cmi occurs in several directories: /home/opam/.opam/4.12/lib/ocaml/compiler-libs, /home/opam/.opam/4.12/lib/ocaml
# ocamlfind: [WARNING] Package `threads': Linking problems may arise because of the missing -thread or -vmthread switch
# menhir bib_parser.mly
# Warning: 5 end-of-stream conflicts were arbitrarily resolved.
# File "<standard.mly>", line 109, characters 18-18:
# Warning: production option(EOF) -> is never reduced.
# Warning: in total, 1 production is never reduced.
# Error: the code back-end requires the type of every nonterminal symbol to be
# known. Please specify the type of every symbol via %type declarations, or
# enable type inference (look up --infer in the manual).
# Type inference is automatically enabled when Menhir is used via Dune,
# provided the dune-project file says (using menhir 2.0) or later.
# The types of the following nonterminal symbols are unknown:
# entry
# field
# list(entry)
# list(field)
# option(COMMA)
# option(EOF)
# make: *** [Makefile:83: bib_parser.mli] Error 1



<><> Error report <><><><><><><><><><><><><><><><><><><><><><><><><><><><><><><>
+- The following actions failed
| - build stog-writing 0.19.0
+- 
+- The following changes have been performed
| - install angstrom            0.15.0
| - install base-bytes          base
| - install bigstringaf         0.9.0
| - install conf-pkg-config     2
| - install cppo                1.6.9
| - install csexp               1.5.1
| - install dune-build-info     3.4.1
| - install dune-configurator   3.4.1
| - install dune-private-libs   3.4.1
| - install dune-site           3.4.1
| - install dyn                 3.4.1
| - install fmt                 0.9.0
| - install gen                 1.0
| - install higlo               0.8
| - install iri                 0.6.0
| - install logs                0.7.0
| - install lwt                 5.6.1
| - install lwt_ppx             2.1.0
| - install menhir              20220210
| - install menhirLib           20220210
| - install menhirSdk           20220210
| - install ocaml-compiler-libs v0.12.4
| - install ocaml-syntax-shims  1.0.0
| - install ocamlbuild          0.14.1
| - install ocf                 0.8.0
| - install ocf_ppx             0.8.0
| - install ocplib-endian       1.2
| - install ordering            3.4.1
| - install pp                  1.1.2
| - install ppx_blob            0.7.2
| - install ppx_derivers        1.2.1
| - install ppxlib              0.27.0
| - install ptime               1.0.0
| - install re                  1.10.4
| - install result              1.5
| - install sedlex              3.0
| - install seq                 base
| - install sexplib0            v0.15.1
| - install stdlib-shims        0.3.0
| - install stdune              3.4.1
| - install stog                0.20.0
| - install stringext           1.6.0
| - install topkg               1.0.5
| - install uchar               0.0.2
| - install uri                 4.2.0
| - install uunf                14.0.0
| - install uutf                1.0.3
| - install xtmpl               0.19.0
| - install xtmpl_ppx           0.19.0
| - install yojson              2.0.2
+- 
# Run eval $(opam env) to update the current shell environment

The former state can be restored with:
    /usr/bin/opam switch import "/home/opam/.opam/4.12/.opam-switch/backup/state-20221210172628.export"
'opam --cli=2.1 install stog-writing.0.19.0 angstrom.0.15.0 base-bytes.base bigstringaf.0.9.0 conf-pkg-config.2 cppo.1.6.9 csexp.1.5.1 dune.3.4.1 dune-build-info.3.4.1 dune-configurator.3.4.1 dune-private-libs.3.4.1 dune-site.3.4.1 dyn.3.4.1 fmt.0.9.0 gen.1.0 higlo.0.8 iri.0.6.0 logs.0.7.0 lwt.5.6.1 lwt_ppx.2.1.0 menhir.20220210 menhirLib.20220210 menhirSdk.20220210 ocaml-compiler-libs.v0.12.4 ocaml-syntax-shims.1.0.0 ocamlbuild.0.14.1 ocamlfind.1.9.5 ocf.0.8.0 ocf_ppx.0.8.0 ocplib-endian.1.2 ordering.3.4.1 pp.1.1.2 ppx_blob.0.7.2 ppx_derivers.1.2.1 ppxlib.0.27.0 ptime.1.0.0 re.1.10.4 result.1.5 sedlex.3.0 seq.base sexplib0.v0.15.1 stdlib-shims.0.3.0 stdune.3.4.1 stog.0.20.0 stringext.1.6.0 topkg.1.0.5 uchar.0.0.2 uri.4.2.0 uunf.14.0.0 uutf.1.0.3 xtmpl.0.19.0 xtmpl_ppx.0.19.0 yojson.2.0.2 --verbose --yes --confirm-level=unsafe-yes' failed.