package stog-writing

  1. Overview
  2. Docs
On This Page
  1. Error log

stog-writing 0.19.0

Error log

The package failed to build. The error log from opam follows.

Opam plugin "depext" may require upgrading/reinstalling. Reinstall the plugin on the current switch? [Y/n] y
The following actions will be performed:
  - recompile opam-depext 1.2.1-1

<><> Processing actions <><><><><><><><><><><><><><><><><><><><><><><><><><><><>
-> retrieved opam-depext.1.2.1-1  (cached)
-> removed   opam-depext.1.2.1-1
-> installed opam-depext.1.2.1-1
Done.

<><> opam-depext.1.2.1-1 installed successfully <><><><><><><><><><><><><><><><>
=> opam-depext is unnecessary when used with opam >= 2.1. Please use opam install directly instead
# Run eval $(opam env) to update the current shell environment

<><> Carrying on to "opam depext -viy stog-writing.0.19.0 yojson.2.1.2 xtmpl_ppx.0.19.0 xtmpl.0.19.0 uutf.1.0.3 uunf.15.0.0 uri.4.4.0 topkg.1.0.7 stringext.1.6.0 stog.0.20.0 stdune.3.13.0 stdlib-shims.0.3.0 sexplib0.v0.16.0 seq.base sedlex.3.2 re.1.11.0 ptime.1.1.0 ppxlib.0.31.0 ppx_derivers.1.2.1 ppx_blob.0.7.2 pp.1.2.0 ordering.3.13.0 ocplib-endian.1.2 ocf_ppx.0.8.0 ocf.0.8.0 ocamlfind.1.9.6 ocamlbuild.0.14.3 ocaml-syntax-shims.1.0.0 ocaml-compiler-libs.v0.12.4 menhirSdk.20231231 menhirLib.20231231 menhirCST.20231231 menhir.20231231 lwt_ppx.2.1.0 lwt.5.7.0 logs.0.7.0 iri.0.7.0 higlo.0.8 gen.1.1 fmt.0.9.0 dyn.3.13.0 dune-site.3.13.0 dune-private-libs.3.13.0 dune-configurator.3.13.0 dune-build-info.3.13.0 dune.3.13.0 csexp.1.5.2 cppo.1.6.9 bigstringaf.0.9.1 base-bytes.base angstrom.0.16.0" 

You are using opam 2.1+, where external dependency handling has been integrated: consider calling opam directly, the 'depext' plugin interface is provided for backwards compatibility only
# Detecting depexts using vars: arch=x86_64, os=linux, os-distribution=debian, os-family=debian
# No extra OS packages requirements found.
[NOTE] Package dune is already installed (current version is 3.13.0).
[NOTE] Package ocamlfind is already installed (current version is 1.9.6).
The following actions will be performed:
  - install cppo                1.6.9
  - install ppx_derivers        1.2.1
  - install ocamlbuild          0.14.3
  - install ordering            3.13.0
  - install menhirSdk           20231231
  - install menhirLib           20231231
  - install seq                 base
  - install ocaml-compiler-libs v0.12.4
  - install base-bytes          base
  - install ocaml-syntax-shims  1.0.0
  - install stdlib-shims        0.3.0
  - install menhirCST           20231231
  - install pp                  1.2.0
  - install dune-build-info     3.13.0
  - install stringext           1.6.0
  - install csexp               1.5.2
  - install sexplib0            v0.16.0
  - install topkg               1.0.7
  - install yojson              2.1.2
  - install re                  1.11.0
  - install gen                 1.1
  - install ocplib-endian       1.2
  - install menhir              20231231
  - install dyn                 3.13.0
  - install dune-configurator   3.13.0
  - install ppxlib              0.31.0
  - install uutf                1.0.3
  - install ptime               1.1.0
  - install fmt                 0.9.0
  - install ocf                 0.8.0
  - install stdune              3.13.0
  - install lwt                 5.7.0
  - install bigstringaf         0.9.1
  - install sedlex              3.2
  - install ppx_blob            0.7.2
  - install uunf                15.0.0
  - install ocf_ppx             0.8.0
  - install dune-private-libs   3.13.0
  - install lwt_ppx             2.1.0
  - install logs                0.7.0
  - install angstrom            0.16.0
  - install iri                 0.7.0
  - install dune-site           3.13.0
  - install uri                 4.4.0
  - install xtmpl               0.19.0
  - install xtmpl_ppx           0.19.0
  - install higlo               0.8
  - install stog                0.20.0
  - install stog-writing        0.19.0
===== 49 to install =====

<><> Processing actions <><><><><><><><><><><><><><><><><><><><><><><><><><><><>
Processing  1/147:
Processing  2/147:
Processing  3/147:
Processing  4/147:
Processing  5/147:
-> installed base-bytes.base
Processing  6/147:
-> retrieved angstrom.0.16.0  (cached)
Processing  7/147:
-> retrieved bigstringaf.0.9.1  (cached)
Processing  8/147:
-> retrieved cppo.1.6.9  (cached)
Processing  9/147:
Processing 10/147: [cppo: dune build]
-> retrieved csexp.1.5.2  (cached)
Processing 11/147: [cppo: dune build]
Processing 12/147: [cppo: dune build] [csexp: dune build]
-> compiled  csexp.1.5.2
Processing 12/147: [cppo: dune build]
-> installed csexp.1.5.2
Processing 13/147: [cppo: dune build]
-> retrieved dune-build-info.3.13.0  (cached)
Processing 14/147: [cppo: dune build]
Processing 15/147: [cppo: dune build] [dune-build-info: rm]
-> retrieved dune-configurator.3.13.0  (cached)
Processing 16/147: [cppo: dune build] [dune-build-info: rm]
Processing 17/147: [cppo: dune build] [dune-build-info: rm] [dune-configurator: rm]
-> compiled  cppo.1.6.9
Processing 17/147: [dune-build-info: rm] [dune-configurator: rm]
-> installed cppo.1.6.9
Processing 18/147: [dune-build-info: rm] [dune-configurator: rm]
-> retrieved dune-private-libs.3.13.0  (cached)
Processing 19/147: [dune-build-info: rm] [dune-configurator: rm]
-> retrieved dune-site.3.13.0  (cached)
Processing 20/147: [dune-build-info: rm] [dune-configurator: rm]
-> retrieved dyn.3.13.0  (cached)
Processing 21/147: [dune-build-info: rm] [dune-configurator: rm]
-> retrieved fmt.0.9.0  (cached)
Processing 22/147: [dune-build-info: rm] [dune-configurator: rm]
-> retrieved gen.1.1  (cached)
Processing 23/147: [dune-build-info: rm] [dune-configurator: rm]
Processing 23/147: [dune-build-info: dune build] [dune-configurator: rm]
-> retrieved higlo.0.8  (cached)
Processing 24/147: [dune-build-info: dune build] [dune-configurator: rm]
Processing 24/147: [dune-build-info: dune build] [dune-configurator: dune build]
-> retrieved iri.0.7.0  (cached)
Processing 25/147: [dune-build-info: dune build] [dune-configurator: dune build]
-> retrieved logs.0.7.0  (cached)
Processing 26/147: [dune-build-info: dune build] [dune-configurator: dune build]
-> retrieved lwt.5.7.0  (cached)
Processing 27/147: [dune-build-info: dune build] [dune-configurator: dune build]
-> retrieved lwt_ppx.2.1.0  (cached)
Processing 28/147: [dune-build-info: dune build] [dune-configurator: dune build]
-> retrieved menhir.20231231  (cached)
Processing 29/147: [dune-build-info: dune build] [dune-configurator: dune build]
-> retrieved menhirCST.20231231  (cached)
Processing 30/147: [dune-build-info: dune build] [dune-configurator: dune build]
Processing 31/147: [dune-build-info: dune build] [dune-configurator: dune build] [menhirCST: dune build]
-> retrieved menhirLib.20231231  (cached)
Processing 32/147: [dune-build-info: dune build] [dune-configurator: dune build] [menhirCST: dune build]
Processing 33/147: [dune-build-info: dune build] [dune-configurator: dune build] [menhirCST: dune build] [menhirLib: dune build]
-> retrieved menhirSdk.20231231  (cached)
Processing 34/147: [dune-build-info: dune build] [dune-configurator: dune build] [menhirCST: dune build] [menhirLib: dune build]
Processing 35/147: [dune-build-info: dune build] [dune-configurator: dune build] [menhirCST: dune build] [menhirLib: dune build] [menhirSdk: dune build]
-> retrieved ocaml-compiler-libs.v0.12.4  (cached)
Processing 36/147: [dune-build-info: dune build] [dune-configurator: dune build] [menhirCST: dune build] [menhirLib: dune build] [menhirSdk: dune build]
Processing 37/147: [dune-build-info: dune build] [dune-configurator: dune build] [menhirCST: dune build] [menhirLib: dune build] [menhirSdk: dune build] [ocaml-compiler-libs: dune build]
-> retrieved ocaml-syntax-shims.1.0.0  (cached)
Processing 38/147: [dune-build-info: dune build] [dune-configurator: dune build] [menhirCST: dune build] [menhirLib: dune build] [menhirSdk: dune build] [ocaml-compiler-libs: dune build]
Processing 39/147: [dune-build-info: dune build] [dune-configurator: dune build] [menhirCST: dune build] [menhirLib: dune build] [menhirSdk: dune build] [ocaml-compiler-libs: dune build] [ocaml-syntax-shims: dune build]
-> retrieved ocamlbuild.0.14.3  (cached)
Processing 40/147: [dune-build-info: dune build] [dune-configurator: dune build] [menhirCST: dune build] [menhirLib: dune build] [menhirSdk: dune build] [ocaml-compiler-libs: dune build] [ocaml-syntax-shims: dune build]
Processing 41/147: [dune-build-info: dune build] [dune-configurator: dune build] [menhirCST: dune build] [menhirLib: dune build] [menhirSdk: dune build] [ocaml-compiler-libs: dune build] [ocaml-syntax-shims: dune build] [ocamlbuild: make configure.make]
-> retrieved ocf.0.8.0  (cached)
Processing 42/147: [dune-build-info: dune build] [dune-configurator: dune build] [menhirCST: dune build] [menhirLib: dune build] [menhirSdk: dune build] [ocaml-compiler-libs: dune build] [ocaml-syntax-shims: dune build] [ocamlbuild: make configure.make]
-> retrieved ocf_ppx.0.8.0  (cached)
Processing 43/147: [dune-build-info: dune build] [dune-configurator: dune build] [menhirCST: dune build] [menhirLib: dune build] [menhirSdk: dune build] [ocaml-compiler-libs: dune build] [ocaml-syntax-shims: dune build] [ocamlbuild: make configure.make]
-> retrieved ocplib-endian.1.2  (cached)
Processing 44/147: [dune-build-info: dune build] [dune-configurator: dune build] [menhirCST: dune build] [menhirLib: dune build] [menhirSdk: dune build] [ocaml-compiler-libs: dune build] [ocaml-syntax-shims: dune build] [ocamlbuild: make configure.make]
Processing 45/147: [dune-build-info: dune build] [dune-configurator: dune build] [menhirCST: dune build] [menhirLib: dune build] [menhirSdk: dune build] [ocaml-compiler-libs: dune build] [ocaml-syntax-shims: dune build] [ocamlbuild: make configure.make] [ocplib-endian: dune build]
- (echo "# This file was generated from configure.make"; \
- echo ;\
- echo "OCAML_PREFIX="; \
- echo "OCAML_BINDIR=/home/opam/.opam/4.12/bin"; \
- echo "OCAML_LIBDIR=/home/opam/.opam/4.12/lib/ocaml"; \
- echo "OCAML_MANDIR=/home/opam/.opam/4.12/man"; \
- echo ;\
- echo "EXT_OBJ=.o"; \
- echo "EXT_ASM=.s"; \
- echo "EXT_LIB=.a"; \
- echo "EXT_DLL=.so"; \
- echo "EXE="; \
- echo ;\
- echo "OCAML_NATIVE=true"; \
- echo "OCAML_NATIVE_TOOLS=true"; \
- echo "NATDYNLINK=true"; \
- echo "SUPPORT_SHARED_LIBRARIES=true"; \
- echo ;\
- echo "PREFIX=/home/opam/.opam/4.12"; \
- echo "BINDIR=/home/opam/.opam/4.12/bin"; \
- echo "LIBDIR=/home/opam/.opam/4.12/lib"; \
- echo "MANDIR=/home/opam/.opam/4.12/man"; \
- ) > Makefile.config
- (echo "(* This file was generated from ../configure.make *)"; \
- echo ;\
- echo 'let bindir = "/home/opam/.opam/4.12/bin"'; \
- echo 'let libdir = "/home/opam/.opam/4.12/lib"'; \
- echo 'let ocaml_libdir = "/home/opam/.opam/4.12/lib/ocaml"'; \
- echo 'let libdir_abs = "/home/opam/.opam/4.12/lib"'; \
- echo 'let ocaml_native = true'; \
- echo 'let ocaml_native_tools = true'; \
- echo 'let supports_shared_libraries = true';\
- echo 'let a = "a"'; \
- echo 'let o = "o"'; \
- echo 'let so = "so"'; \
- echo 'let ext_dll = ".so"'; \
- echo 'let exe = ""'; \
- echo 'let version = "0.14.3"'; \
- ) > src/ocamlbuild_config.ml
Processing 45/147: [dune-build-info: dune build] [dune-configurator: dune build] [menhirCST: dune build] [menhirLib: dune build] [menhirSdk: dune build] [ocaml-compiler-libs: dune build] [ocaml-syntax-shims: dune build] [ocamlbuild: make check-if-preinstalled] [ocplib-endian: dune build]
-> retrieved pp.1.2.0  (cached)
Processing 46/147: [dune-build-info: dune build] [dune-configurator: dune build] [menhirCST: dune build] [menhirLib: dune build] [menhirSdk: dune build] [ocaml-compiler-libs: dune build] [ocaml-syntax-shims: dune build] [ocamlbuild: make check-if-preinstalled] [ocplib-endian: dune build]
Processing 47/147: [dune-build-info: dune build] [dune-configurator: dune build] [menhirCST: dune build] [menhirLib: dune build] [menhirSdk: dune build] [ocaml-compiler-libs: dune build] [ocaml-syntax-shims: dune build] [ocamlbuild: make check-if-preinstalled] [ocplib-endian: dune build] [pp: dune build]
-> retrieved ppx_blob.0.7.2  (cached)
Processing 48/147: [dune-build-info: dune build] [dune-configurator: dune build] [menhirCST: dune build] [menhirLib: dune build] [menhirSdk: dune build] [ocaml-compiler-libs: dune build] [ocaml-syntax-shims: dune build] [ocamlbuild: make check-if-preinstalled] [ocplib-endian: dune build] [pp: dune build]
-> retrieved ppx_derivers.1.2.1  (cached)
Processing 49/147: [dune-build-info: dune build] [dune-configurator: dune build] [menhirCST: dune build] [menhirLib: dune build] [menhirSdk: dune build] [ocaml-compiler-libs: dune build] [ocaml-syntax-shims: dune build] [ocamlbuild: make check-if-preinstalled] [ocplib-endian: dune build] [pp: dune build]
Processing 50/147: [dune-build-info: dune build] [dune-configurator: dune build] [menhirCST: dune build] [menhirLib: dune build] [menhirSdk: dune build] [ocaml-compiler-libs: dune build] [ocaml-syntax-shims: dune build] [ocamlbuild: make check-if-preinstalled] [ocplib-endian: dune build] [pp: dune build] [ppx_derivers: dune build]
-> compiled  menhirCST.20231231
Processing 50/147: [dune-build-info: dune build] [dune-configurator: dune build] [menhirLib: dune build] [menhirSdk: dune build] [ocaml-compiler-libs: dune build] [ocaml-syntax-shims: dune build] [ocamlbuild: make check-if-preinstalled] [ocplib-endian: dune build] [pp: dune build] [ppx_derivers: dune build]
-> installed menhirCST.20231231
Processing 51/147: [dune-build-info: dune build] [dune-configurator: dune build] [menhirLib: dune build] [menhirSdk: dune build] [ocaml-compiler-libs: dune build] [ocaml-syntax-shims: dune build] [ocamlbuild: make check-if-preinstalled] [ocplib-endian: dune build] [pp: dune build] [ppx_derivers: dune build]
-> retrieved ptime.1.1.0  (cached)
Processing 52/147: [dune-build-info: dune build] [dune-configurator: dune build] [menhirLib: dune build] [menhirSdk: dune build] [ocaml-compiler-libs: dune build] [ocaml-syntax-shims: dune build] [ocamlbuild: make check-if-preinstalled] [ocplib-endian: dune build] [pp: dune build] [ppx_derivers: dune build]
-> retrieved re.1.11.0  (cached)
Processing 53/147: [dune-build-info: dune build] [dune-configurator: dune build] [menhirLib: dune build] [menhirSdk: dune build] [ocaml-compiler-libs: dune build] [ocaml-syntax-shims: dune build] [ocamlbuild: make check-if-preinstalled] [ocplib-endian: dune build] [pp: dune build] [ppx_derivers: dune build]
-> retrieved sedlex.3.2  (cached)
Processing 54/147: [dune-build-info: dune build] [dune-configurator: dune build] [menhirLib: dune build] [menhirSdk: dune build] [ocaml-compiler-libs: dune build] [ocaml-syntax-shims: dune build] [ocamlbuild: make check-if-preinstalled] [ocplib-endian: dune build] [pp: dune build] [ppx_derivers: dune build]
Processing 55/147: [dune-build-info: dune build] [dune-configurator: dune build] [menhirLib: dune build] [menhirSdk: dune build] [ocaml-compiler-libs: dune build] [ocaml-syntax-shims: dune build] [ocamlbuild: make check-if-preinstalled] [ocplib-endian: dune build] [pp: dune build] [ppx_derivers: dune build]
Processing 56/147: [dune-build-info: dune build] [dune-configurator: dune build] [menhirLib: dune build] [menhirSdk: dune build] [ocaml-compiler-libs: dune build] [ocaml-syntax-shims: dune build] [ocamlbuild: make check-if-preinstalled] [ocplib-endian: dune build] [pp: dune build] [ppx_derivers: dune build]
-> installed seq.base
Processing 57/147: [dune-build-info: dune build] [dune-configurator: dune build] [menhirLib: dune build] [menhirSdk: dune build] [ocaml-compiler-libs: dune build] [ocaml-syntax-shims: dune build] [ocamlbuild: make check-if-preinstalled] [ocplib-endian: dune build] [pp: dune build] [ppx_derivers: dune build]
Processing 58/147: [dune-build-info: dune build] [dune-configurator: dune build] [gen: dune build] [menhirLib: dune build] [menhirSdk: dune build] [ocaml-compiler-libs: dune build] [ocaml-syntax-shims: dune build] [ocamlbuild: make check-if-preinstalled] [ocplib-endian: dune build] [pp: dune build] [ppx_derivers: dune build]
Processing 59/147: [dune-build-info: dune build] [dune-configurator: dune build] [gen: dune build] [menhirLib: dune build] [menhirSdk: dune build] [ocaml-compiler-libs: dune build] [ocaml-syntax-shims: dune build] [ocamlbuild: make check-if-preinstalled] [ocplib-endian: dune build] [pp: dune build] [ppx_derivers: dune build] [re: dune build]
-> retrieved ppxlib.0.31.0  (cached)
Processing 60/147: [dune-build-info: dune build] [dune-configurator: dune build] [gen: dune build] [menhirLib: dune build] [menhirSdk: dune build] [ocaml-compiler-libs: dune build] [ocaml-syntax-shims: dune build] [ocamlbuild: make check-if-preinstalled] [ocplib-endian: dune build] [pp: dune build] [ppx_derivers: dune build] [re: dune build]
-> retrieved sexplib0.v0.16.0  (cached)
Processing 61/147: [dune-build-info: dune build] [dune-configurator: dune build] [gen: dune build] [menhirLib: dune build] [menhirSdk: dune build] [ocaml-compiler-libs: dune build] [ocaml-syntax-shims: dune build] [ocamlbuild: make check-if-preinstalled] [ocplib-endian: dune build] [pp: dune build] [ppx_derivers: dune build] [re: dune build]
Processing 62/147: [dune-build-info: dune build] [dune-configurator: dune build] [gen: dune build] [menhirLib: dune build] [menhirSdk: dune build] [ocaml-compiler-libs: dune build] [ocaml-syntax-shims: dune build] [ocamlbuild: make check-if-preinstalled] [ocplib-endian: dune build] [pp: dune build] [ppx_derivers: dune build] [re: dune build] [sexplib0: dune build]
-> retrieved stdlib-shims.0.3.0  (cached)
Processing 63/147: [dune-build-info: dune build] [dune-configurator: dune build] [gen: dune build] [menhirLib: dune build] [menhirSdk: dune build] [ocaml-compiler-libs: dune build] [ocaml-syntax-shims: dune build] [ocamlbuild: make check-if-preinstalled] [ocplib-endian: dune build] [pp: dune build] [ppx_derivers: dune build] [re: dune build] [sexplib0: dune build]
Processing 64/147: [dune-build-info: dune build] [dune-configurator: dune build] [gen: dune build] [menhirLib: dune build] [menhirSdk: dune build] [ocaml-compiler-libs: dune build] [ocaml-syntax-shims: dune build] [ocamlbuild: make check-if-preinstalled] [ocplib-endian: dune build] [pp: dune build] [ppx_derivers: dune build] [re: dune build] [sexplib0: dune build] [stdlib-shims: dune build]
-> compiled  ppx_derivers.1.2.1
Processing 64/147: [dune-build-info: dune build] [dune-configurator: dune build] [gen: dune build] [menhirLib: dune build] [menhirSdk: dune build] [ocaml-compiler-libs: dune build] [ocaml-syntax-shims: dune build] [ocamlbuild: make check-if-preinstalled] [ocplib-endian: dune build] [pp: dune build] [re: dune build] [sexplib0: dune build] [stdlib-shims: dune build]
-> installed ppx_derivers.1.2.1
Processing 65/147: [dune-build-info: dune build] [dune-configurator: dune build] [gen: dune build] [menhirLib: dune build] [menhirSdk: dune build] [ocaml-compiler-libs: dune build] [ocaml-syntax-shims: dune build] [ocamlbuild: make check-if-preinstalled] [ocplib-endian: dune build] [pp: dune build] [re: dune build] [sexplib0: dune build] [stdlib-shims: dune build]
-> retrieved stog.0.20.0  (cached)
Processing 66/147: [dune-build-info: dune build] [dune-configurator: dune build] [gen: dune build] [menhirLib: dune build] [menhirSdk: dune build] [ocaml-compiler-libs: dune build] [ocaml-syntax-shims: dune build] [ocamlbuild: make check-if-preinstalled] [ocplib-endian: dune build] [pp: dune build] [re: dune build] [sexplib0: dune build] [stdlib-shims: dune build]
-> compiled  pp.1.2.0
Processing 66/147: [dune-build-info: dune build] [dune-configurator: dune build] [gen: dune build] [menhirLib: dune build] [menhirSdk: dune build] [ocaml-compiler-libs: dune build] [ocaml-syntax-shims: dune build] [ocamlbuild: make check-if-preinstalled] [ocplib-endian: dune build] [re: dune build] [sexplib0: dune build] [stdlib-shims: dune build]
-> installed pp.1.2.0
Processing 67/147: [dune-build-info: dune build] [dune-configurator: dune build] [gen: dune build] [menhirLib: dune build] [menhirSdk: dune build] [ocaml-compiler-libs: dune build] [ocaml-syntax-shims: dune build] [ocamlbuild: make check-if-preinstalled] [ocplib-endian: dune build] [re: dune build] [sexplib0: dune build] [stdlib-shims: dune build]
-> retrieved stog-writing.0.19.0  (cached)
Processing 68/147: [dune-build-info: dune build] [dune-configurator: dune build] [gen: dune build] [menhirLib: dune build] [menhirSdk: dune build] [ocaml-compiler-libs: dune build] [ocaml-syntax-shims: dune build] [ocamlbuild: make check-if-preinstalled] [ocplib-endian: dune build] [re: dune build] [sexplib0: dune build] [stdlib-shims: dune build]
-> compiled  menhirSdk.20231231
Processing 68/147: [dune-build-info: dune build] [dune-configurator: dune build] [gen: dune build] [menhirLib: dune build] [ocaml-compiler-libs: dune build] [ocaml-syntax-shims: dune build] [ocamlbuild: make check-if-preinstalled] [ocplib-endian: dune build] [re: dune build] [sexplib0: dune build] [stdlib-shims: dune build]
-> installed menhirSdk.20231231
Processing 69/147: [dune-build-info: dune build] [dune-configurator: dune build] [gen: dune build] [menhirLib: dune build] [ocaml-compiler-libs: dune build] [ocaml-syntax-shims: dune build] [ocamlbuild: make check-if-preinstalled] [ocplib-endian: dune build] [re: dune build] [sexplib0: dune build] [stdlib-shims: dune build]
-> retrieved stringext.1.6.0  (cached)
Processing 70/147: [dune-build-info: dune build] [dune-configurator: dune build] [gen: dune build] [menhirLib: dune build] [ocaml-compiler-libs: dune build] [ocaml-syntax-shims: dune build] [ocamlbuild: make check-if-preinstalled] [ocplib-endian: dune build] [re: dune build] [sexplib0: dune build] [stdlib-shims: dune build]
Processing 71/147: [dune-build-info: dune build] [dune-configurator: dune build] [gen: dune build] [menhirLib: dune build] [ocaml-compiler-libs: dune build] [ocaml-syntax-shims: dune build] [ocamlbuild: make check-if-preinstalled] [ocplib-endian: dune build] [re: dune build] [sexplib0: dune build] [stdlib-shims: dune build] [stringext: dune build]
-> retrieved topkg.1.0.7  (cached)
Processing 72/147: [dune-build-info: dune build] [dune-configurator: dune build] [gen: dune build] [menhirLib: dune build] [ocaml-compiler-libs: dune build] [ocaml-syntax-shims: dune build] [ocamlbuild: make check-if-preinstalled] [ocplib-endian: dune build] [re: dune build] [sexplib0: dune build] [stdlib-shims: dune build] [stringext: dune build]
-> compiled  ocplib-endian.1.2
Processing 72/147: [dune-build-info: dune build] [dune-configurator: dune build] [gen: dune build] [menhirLib: dune build] [ocaml-compiler-libs: dune build] [ocaml-syntax-shims: dune build] [ocamlbuild: make check-if-preinstalled] [re: dune build] [sexplib0: dune build] [stdlib-shims: dune build] [stringext: dune build]
-> installed ocplib-endian.1.2
Processing 73/147: [dune-build-info: dune build] [dune-configurator: dune build] [gen: dune build] [menhirLib: dune build] [ocaml-compiler-libs: dune build] [ocaml-syntax-shims: dune build] [ocamlbuild: make check-if-preinstalled] [re: dune build] [sexplib0: dune build] [stdlib-shims: dune build] [stringext: dune build]
-> retrieved uri.4.4.0  (cached)
Processing 74/147: [dune-build-info: dune build] [dune-configurator: dune build] [gen: dune build] [menhirLib: dune build] [ocaml-compiler-libs: dune build] [ocaml-syntax-shims: dune build] [ocamlbuild: make check-if-preinstalled] [re: dune build] [sexplib0: dune build] [stdlib-shims: dune build] [stringext: dune build]
-> retrieved ordering.3.13.0  (cached)
Processing 75/147: [dune-build-info: dune build] [dune-configurator: dune build] [gen: dune build] [menhirLib: dune build] [ocaml-compiler-libs: dune build] [ocaml-syntax-shims: dune build] [ocamlbuild: make check-if-preinstalled] [re: dune build] [sexplib0: dune build] [stdlib-shims: dune build] [stringext: dune build]
Processing 76/147: [dune-build-info: dune build] [dune-configurator: dune build] [gen: dune build] [menhirLib: dune build] [ocaml-compiler-libs: dune build] [ocaml-syntax-shims: dune build] [ocamlbuild: make check-if-preinstalled] [ordering: rm] [re: dune build] [sexplib0: dune build] [stdlib-shims: dune build] [stringext: dune build]
-> compiled  dune-build-info.3.13.0
Processing 76/147: [dune-configurator: dune build] [gen: dune build] [menhirLib: dune build] [ocaml-compiler-libs: dune build] [ocaml-syntax-shims: dune build] [ocamlbuild: make check-if-preinstalled] [ordering: rm] [re: dune build] [sexplib0: dune build] [stdlib-shims: dune build] [stringext: dune build]
-> installed dune-build-info.3.13.0
Processing 77/147: [dune-configurator: dune build] [gen: dune build] [menhirLib: dune build] [ocaml-compiler-libs: dune build] [ocaml-syntax-shims: dune build] [ocamlbuild: make check-if-preinstalled] [ordering: rm] [re: dune build] [sexplib0: dune build] [stdlib-shims: dune build] [stringext: dune build]
- (cd _build/default/lib/pack && ./pack.exe)
- Creating menhirLib.ml...
- Creating menhirLib.mli...
-> compiled  menhirLib.20231231
Processing 77/147: [dune-configurator: dune build] [gen: dune build] [ocaml-compiler-libs: dune build] [ocaml-syntax-shims: dune build] [ocamlbuild: make check-if-preinstalled] [ordering: rm] [re: dune build] [sexplib0: dune build] [stdlib-shims: dune build] [stringext: dune build]
-> installed menhirLib.20231231
Processing 78/147: [dune-configurator: dune build] [gen: dune build] [ocaml-compiler-libs: dune build] [ocaml-syntax-shims: dune build] [ocamlbuild: make check-if-preinstalled] [ordering: rm] [re: dune build] [sexplib0: dune build] [stdlib-shims: dune build] [stringext: dune build]
Processing 79/147: [dune-configurator: dune build] [gen: dune build] [menhir: dune build] [ocaml-compiler-libs: dune build] [ocaml-syntax-shims: dune build] [ocamlbuild: make check-if-preinstalled] [ordering: rm] [re: dune build] [sexplib0: dune build] [stdlib-shims: dune build] [stringext: dune build]
-> compiled  ocaml-compiler-libs.v0.12.4
Processing 79/147: [dune-configurator: dune build] [gen: dune build] [menhir: dune build] [ocaml-syntax-shims: dune build] [ocamlbuild: make check-if-preinstalled] [ordering: rm] [re: dune build] [sexplib0: dune build] [stdlib-shims: dune build] [stringext: dune build]
-> installed ocaml-compiler-libs.v0.12.4
Processing 80/147: [dune-configurator: dune build] [gen: dune build] [menhir: dune build] [ocaml-syntax-shims: dune build] [ocamlbuild: make check-if-preinstalled] [ordering: rm] [re: dune build] [sexplib0: dune build] [stdlib-shims: dune build] [stringext: dune build]
-> compiled  ocaml-syntax-shims.1.0.0
Processing 80/147: [dune-configurator: dune build] [gen: dune build] [menhir: dune build] [ocamlbuild: make check-if-preinstalled] [ordering: rm] [re: dune build] [sexplib0: dune build] [stdlib-shims: dune build] [stringext: dune build]
-> installed ocaml-syntax-shims.1.0.0
Processing 81/147: [dune-configurator: dune build] [gen: dune build] [menhir: dune build] [ocamlbuild: make check-if-preinstalled] [ordering: rm] [re: dune build] [sexplib0: dune build] [stdlib-shims: dune build] [stringext: dune build]
-> compiled  gen.1.1
Processing 81/147: [dune-configurator: dune build] [menhir: dune build] [ocamlbuild: make check-if-preinstalled] [ordering: rm] [re: dune build] [sexplib0: dune build] [stdlib-shims: dune build] [stringext: dune build]
-> installed gen.1.1
Processing 82/147: [dune-configurator: dune build] [menhir: dune build] [ocamlbuild: make check-if-preinstalled] [ordering: rm] [re: dune build] [sexplib0: dune build] [stdlib-shims: dune build] [stringext: dune build]
-> compiled  re.1.11.0
Processing 82/147: [dune-configurator: dune build] [menhir: dune build] [ocamlbuild: make check-if-preinstalled] [ordering: rm] [sexplib0: dune build] [stdlib-shims: dune build] [stringext: dune build]
-> installed re.1.11.0
Processing 83/147: [dune-configurator: dune build] [menhir: dune build] [ocamlbuild: make check-if-preinstalled] [ordering: rm] [sexplib0: dune build] [stdlib-shims: dune build] [stringext: dune build]
-> compiled  dune-configurator.3.13.0
Processing 83/147: [menhir: dune build] [ocamlbuild: make check-if-preinstalled] [ordering: rm] [sexplib0: dune build] [stdlib-shims: dune build] [stringext: dune build]
-> installed dune-configurator.3.13.0
Processing 84/147: [menhir: dune build] [ocamlbuild: make check-if-preinstalled] [ordering: rm] [sexplib0: dune build] [stdlib-shims: dune build] [stringext: dune build]
Processing 85/147: [bigstringaf: dune build] [menhir: dune build] [ocamlbuild: make check-if-preinstalled] [ordering: rm] [sexplib0: dune build] [stdlib-shims: dune build] [stringext: dune build]
Processing 86/147: [bigstringaf: dune build] [lwt: dune exec] [menhir: dune build] [ocamlbuild: make check-if-preinstalled] [ordering: rm] [sexplib0: dune build] [stdlib-shims: dune build] [stringext: dune build]
-> retrieved stdune.3.13.0  (cached)
Processing 87/147: [bigstringaf: dune build] [lwt: dune exec] [menhir: dune build] [ocamlbuild: make check-if-preinstalled] [ordering: rm] [sexplib0: dune build] [stdlib-shims: dune build] [stringext: dune build]
-> compiled  sexplib0.v0.16.0
Processing 87/147: [bigstringaf: dune build] [lwt: dune exec] [menhir: dune build] [ocamlbuild: make check-if-preinstalled] [ordering: rm] [stdlib-shims: dune build] [stringext: dune build]
-> installed sexplib0.v0.16.0
Processing 88/147: [bigstringaf: dune build] [lwt: dune exec] [menhir: dune build] [ocamlbuild: make check-if-preinstalled] [ordering: rm] [stdlib-shims: dune build] [stringext: dune build]
-> compiled  stdlib-shims.0.3.0
Processing 88/147: [bigstringaf: dune build] [lwt: dune exec] [menhir: dune build] [ocamlbuild: make check-if-preinstalled] [ordering: rm] [stringext: dune build]
-> installed stdlib-shims.0.3.0
Processing 89/147: [bigstringaf: dune build] [lwt: dune exec] [menhir: dune build] [ocamlbuild: make check-if-preinstalled] [ordering: rm] [stringext: dune build]
Processing 90/147: [bigstringaf: dune build] [lwt: dune exec] [menhir: dune build] [ocamlbuild: make check-if-preinstalled] [ordering: rm] [ppxlib: dune build] [stringext: dune build]
-> compiled  stringext.1.6.0
Processing 90/147: [bigstringaf: dune build] [lwt: dune exec] [menhir: dune build] [ocamlbuild: make check-if-preinstalled] [ordering: rm] [ppxlib: dune build]
-> installed stringext.1.6.0
Processing 91/147: [bigstringaf: dune build] [lwt: dune exec] [menhir: dune build] [ocamlbuild: make check-if-preinstalled] [ordering: rm] [ppxlib: dune build]
-> retrieved uunf.15.0.0  (cached)
Processing 92/147: [bigstringaf: dune build] [lwt: dune exec] [menhir: dune build] [ocamlbuild: make check-if-preinstalled] [ordering: rm] [ppxlib: dune build]
-> retrieved uutf.1.0.3  (cached)
Processing 93/147: [bigstringaf: dune build] [lwt: dune exec] [menhir: dune build] [ocamlbuild: make check-if-preinstalled] [ordering: rm] [ppxlib: dune build]
-> compiled  bigstringaf.0.9.1
Processing 93/147: [lwt: dune exec] [menhir: dune build] [ocamlbuild: make check-if-preinstalled] [ordering: rm] [ppxlib: dune build]
-> installed bigstringaf.0.9.1
Processing 94/147: [lwt: dune exec] [menhir: dune build] [ocamlbuild: make check-if-preinstalled] [ordering: rm] [ppxlib: dune build]
Processing 95/147: [angstrom: dune build] [lwt: dune exec] [menhir: dune build] [ocamlbuild: make check-if-preinstalled] [ordering: rm] [ppxlib: dune build]
-> retrieved xtmpl.0.19.0  (cached)
-> retrieved xtmpl_ppx.0.19.0  (cached)
-> retrieved yojson.2.1.2  (cached)
Processing 96/147: [angstrom: dune build] [lwt: dune exec] [menhir: dune build] [ocamlbuild: make check-if-preinstalled] [ordering: rm] [ppxlib: dune build] [yojson: dune build]
Processing 96/147: [angstrom: dune build] [lwt: dune exec] [menhir: dune build] [ocamlbuild: make check-if-preinstalled] [ordering: dune build] [ppxlib: dune build] [yojson: dune build]
Processing 96/147: [angstrom: dune build] [lwt: dune build] [menhir: dune build] [ocamlbuild: make check-if-preinstalled] [ordering: dune build] [ppxlib: dune build] [yojson: dune build]
-> compiled  angstrom.0.16.0
Processing 96/147: [lwt: dune build] [menhir: dune build] [ocamlbuild: make check-if-preinstalled] [ordering: dune build] [ppxlib: dune build] [yojson: dune build]
-> installed angstrom.0.16.0
Processing 97/147: [lwt: dune build] [menhir: dune build] [ocamlbuild: make check-if-preinstalled] [ordering: dune build] [ppxlib: dune build] [yojson: dune build]
Processing 98/147: [lwt: dune build] [menhir: dune build] [ocamlbuild: make check-if-preinstalled] [ordering: dune build] [ppxlib: dune build] [uri: dune build] [yojson: dune build]
-> compiled  yojson.2.1.2
Processing 98/147: [lwt: dune build] [menhir: dune build] [ocamlbuild: make check-if-preinstalled] [ordering: dune build] [ppxlib: dune build] [uri: dune build]
-> installed yojson.2.1.2
Processing 99/147: [lwt: dune build] [menhir: dune build] [ocamlbuild: make check-if-preinstalled] [ordering: dune build] [ppxlib: dune build] [uri: dune build]
Processing 100/147: [lwt: dune build] [menhir: dune build] [ocamlbuild: make check-if-preinstalled] [ocf: dune build] [ordering: dune build] [ppxlib: dune build] [uri: dune build]
-> compiled  ordering.3.13.0
Processing 100/147: [lwt: dune build] [menhir: dune build] [ocamlbuild: make check-if-preinstalled] [ocf: dune build] [ppxlib: dune build] [uri: dune build]
-> installed ordering.3.13.0
Processing 101/147: [lwt: dune build] [menhir: dune build] [ocamlbuild: make check-if-preinstalled] [ocf: dune build] [ppxlib: dune build] [uri: dune build]
Processing 102/147: [dyn: rm] [lwt: dune build] [menhir: dune build] [ocamlbuild: make check-if-preinstalled] [ocf: dune build] [ppxlib: dune build] [uri: dune build]
Processing 102/147: [dyn: rm] [lwt: dune build] [menhir: dune build] [ocamlbuild: make check-if-preinstalled] [ocf: dune install] [ppxlib: dune build] [uri: dune build]
Processing 102/147: [dyn: dune build] [lwt: dune build] [menhir: dune build] [ocamlbuild: make check-if-preinstalled] [ocf: dune install] [ppxlib: dune build] [uri: dune build]
-> compiled  ocf.0.8.0
Processing 102/147: [dyn: dune build] [lwt: dune build] [menhir: dune build] [ocamlbuild: make check-if-preinstalled] [ppxlib: dune build] [uri: dune build]
-> installed ocf.0.8.0
Processing 103/147: [dyn: dune build] [lwt: dune build] [menhir: dune build] [ocamlbuild: make check-if-preinstalled] [ppxlib: dune build] [uri: dune build]
-> compiled  uri.4.4.0
Processing 103/147: [dyn: dune build] [lwt: dune build] [menhir: dune build] [ocamlbuild: make check-if-preinstalled] [ppxlib: dune build]
-> installed uri.4.4.0
Processing 104/147: [dyn: dune build] [lwt: dune build] [menhir: dune build] [ocamlbuild: make check-if-preinstalled] [ppxlib: dune build]
-> compiled  dyn.3.13.0
Processing 104/147: [lwt: dune build] [menhir: dune build] [ocamlbuild: make check-if-preinstalled] [ppxlib: dune build]
-> installed dyn.3.13.0
Processing 105/147: [lwt: dune build] [menhir: dune build] [ocamlbuild: make check-if-preinstalled] [ppxlib: dune build]
Processing 106/147: [lwt: dune build] [menhir: dune build] [ocamlbuild: make check-if-preinstalled] [ppxlib: dune build] [stdune: rm]
- if test -d /home/opam/.opam/4.12/lib/ocaml/ocamlbuild; then\
-   >&2 echo "ERROR: Preinstalled ocamlbuild detected at"\
-        "/home/opam/.opam/4.12/lib/ocaml/ocamlbuild";\
-   >&2 echo "Installation aborted; if you want to bypass this"\
-         "safety check, pass CHECK_IF_PREINSTALLED=false to make";\
-   exit 2;\
- fi
- ocamlc.opt -w +L -w +R -w +Z -I src -I plugin-lib -I bin -I +unix -safe-string -bin-annot -strict-sequence -c src/const.ml
- ocamlc.opt -w +L -w +R -w +Z -I src -I plugin-lib -I bin -I +unix -safe-string -bin-annot -strict-sequence -c src/loc.mli
- ocamlc.opt -w +L -w +R -w +Z -I src -I plugin-lib -I bin -I +unix -safe-string -bin-annot -strict-sequence -c src/loc.ml
- ocamlc.opt -w +L -w +R -w +Z -I src -I plugin-lib -I bin -I +unix -safe-string -bin-annot -strict-sequence -c src/discard_printf.mli
- ocamlc.opt -w +L -w +R -w +Z -I src -I plugin-lib -I bin -I +unix -safe-string -bin-annot -strict-sequence -c src/discard_printf.ml
- ocamlc.opt -w +L -w +R -w +Z -I src -I plugin-lib -I bin -I +unix -safe-string -bin-annot -strict-sequence -c src/signatures.mli
- ocamlc.opt -w +L -w +R -w +Z -I src -I plugin-lib -I bin -I +unix -safe-string -bin-annot -strict-sequence -c src/my_std.mli
- ocamlc.opt -w +L -w +R -w +Z -I src -I plugin-lib -I bin -I +unix -safe-string -bin-annot -strict-sequence -c src/my_std.ml
- ocamlc.opt -w +L -w +R -w +Z -I src -I plugin-lib -I bin -I +unix -safe-string -bin-annot -strict-sequence -c src/my_unix.mli
- ocamlc.opt -w +L -w +R -w +Z -I src -I plugin-lib -I bin -I +unix -safe-string -bin-annot -strict-sequence -c src/my_unix.ml
- ocamlc.opt -w +L -w +R -w +Z -I src -I plugin-lib -I bin -I +unix -safe-string -bin-annot -strict-sequence -c src/tags.mli
- ocamlc.opt -w +L -w +R -w +Z -I src -I plugin-lib -I bin -I +unix -safe-string -bin-annot -strict-sequence -c src/tags.ml
- ocamlc.opt -w +L -w +R -w +Z -I src -I plugin-lib -I bin -I +unix -safe-string -bin-annot -strict-sequence -c src/display.mli
- ocamlc.opt -w +L -w +R -w +Z -I src -I plugin-lib -I bin -I +unix -safe-string -bin-annot -strict-sequence -c src/display.ml
- ocamlc.opt -w +L -w +R -w +Z -I src -I plugin-lib -I bin -I +unix -safe-string -bin-annot -strict-sequence -c src/log.mli
- ocamlc.opt -w +L -w +R -w +Z -I src -I plugin-lib -I bin -I +unix -safe-string -bin-annot -strict-sequence -c src/log.ml
- ocamlc.opt -w +L -w +R -w +Z -I src -I plugin-lib -I bin -I +unix -safe-string -bin-annot -strict-sequence -c src/shell.mli
- ocamlc.opt -w +L -w +R -w +Z -I src -I plugin-lib -I bin -I +unix -safe-string -bin-annot -strict-sequence -c src/shell.ml
- ocamlc.opt -w +L -w +R -w +Z -I src -I plugin-lib -I bin -I +unix -safe-string -bin-annot -strict-sequence -c src/bool.mli
- ocamlc.opt -w +L -w +R -w +Z -I src -I plugin-lib -I bin -I +unix -safe-string -bin-annot -strict-sequence -c src/bool.ml
- ocamlc.opt -w +L -w +R -w +Z -I src -I plugin-lib -I bin -I +unix -safe-string -bin-annot -strict-sequence -c src/glob_ast.mli
- ocamlc.opt -w +L -w +R -w +Z -I src -I plugin-lib -I bin -I +unix -safe-string -bin-annot -strict-sequence -c src/glob_ast.ml
- ocamllex.opt src/glob_lexer.mll
- 55 states, 419 transitions, table size 2006 bytes
- ocamlc.opt -w +L -w +R -w +Z -I src -I plugin-lib -I bin -I +unix -safe-string -bin-annot -strict-sequence -c src/glob_lexer.mli
- ocamlc.opt -w +L -w +R -w +Z -I src -I plugin-lib -I bin -I +unix -safe-string -bin-annot -strict-sequence -c src/glob_lexer.ml
- ocamlc.opt -w +L -w +R -w +Z -I src -I plugin-lib -I bin -I +unix -safe-string -bin-annot -strict-sequence -c src/glob.mli
- ocamlc.opt -w +L -w +R -w +Z -I src -I plugin-lib -I bin -I +unix -safe-string -bin-annot -strict-sequence -c src/glob.ml
- ocamllex.opt src/lexers.mll
- 251 states, 1051 transitions, table size 5710 bytes
- 4334 additional bytes used for bindings
- ocamlc.opt -w +L -w +R -w +Z -I src -I plugin-lib -I bin -I +unix -safe-string -bin-annot -strict-sequence -c src/lexers.mli
- ocamlc.opt -w +L -w +R -w +Z -I src -I plugin-lib -I bin -I +unix -safe-string -bin-annot -strict-sequence -c src/lexers.ml
- ocamlc.opt -w +L -w +R -w +Z -I src -I plugin-lib -I bin -I +unix -safe-string -bin-annot -strict-sequence -c src/param_tags.mli
- ocamlc.opt -w +L -w +R -w +Z -I src -I plugin-lib -I bin -I +unix -safe-string -bin-annot -strict-sequence -c src/param_tags.ml
- ocamlc.opt -w +L -w +R -w +Z -I src -I plugin-lib -I bin -I +unix -safe-string -bin-annot -strict-sequence -c src/command.mli
- ocamlc.opt -w +L -w +R -w +Z -I src -I plugin-lib -I bin -I +unix -safe-string -bin-annot -strict-sequence -c src/command.ml
- ocamlc.opt -w +L -w +R -w +Z -I src -I plugin-lib -I bin -I +unix -safe-string -bin-annot -strict-sequence -c src/ocamlbuild_config.ml
- ocamlc.opt -w +L -w +R -w +Z -I src -I plugin-lib -I bin -I +unix -safe-string -bin-annot -strict-sequence -c src/ocamlbuild_where.mli
- ocamlc.opt -w +L -w +R -w +Z -I src -I plugin-lib -I bin -I +unix -safe-string -bin-annot -strict-sequence -c src/ocamlbuild_where.ml
- ocamlc.opt -w +L -w +R -w +Z -I src -I plugin-lib -I bin -I +unix -safe-string -bin-annot -strict-sequence -c src/slurp.mli
- ocamlc.opt -w +L -w +R -w +Z -I src -I plugin-lib -I bin -I +unix -safe-string -bin-annot -strict-sequence -c src/slurp.ml
- ocamlc.opt -w +L -w +R -w +Z -I src -I plugin-lib -I bin -I +unix -safe-string -bin-annot -strict-sequence -c src/options.mli
- ocamlc.opt -w +L -w +R -w +Z -I src -I plugin-lib -I bin -I +unix -safe-string -bin-annot -strict-sequence -c src/options.ml
- ocamlc.opt -w +L -w +R -w +Z -I src -I plugin-lib -I bin -I +unix -safe-string -bin-annot -strict-sequence -c src/pathname.mli
- ocamlc.opt -w +L -w +R -w +Z -I src -I plugin-lib -I bin -I +unix -safe-string -bin-annot -strict-sequence -c src/pathname.ml
- ocamlc.opt -w +L -w +R -w +Z -I src -I plugin-lib -I bin -I +unix -safe-string -bin-annot -strict-sequence -c src/configuration.mli
- ocamlc.opt -w +L -w +R -w +Z -I src -I plugin-lib -I bin -I +unix -safe-string -bin-annot -strict-sequence -c src/configuration.ml
- ocamlc.opt -w +L -w +R -w +Z -I src -I plugin-lib -I bin -I +unix -safe-string -bin-annot -strict-sequence -c src/flags.mli
- ocamlc.opt -w +L -w +R -w +Z -I src -I plugin-lib -I bin -I +unix -safe-string -bin-annot -strict-sequence -c src/flags.ml
- ocamlc.opt -w +L -w +R -w +Z -I src -I plugin-lib -I bin -I +unix -safe-string -bin-annot -strict-sequence -c src/hygiene.mli
- ocamlc.opt -w +L -w +R -w +Z -I src -I plugin-lib -I bin -I +unix -safe-string -bin-annot -strict-sequence -c src/hygiene.ml
- ocamlc.opt -w +L -w +R -w +Z -I src -I plugin-lib -I bin -I +unix -safe-string -bin-annot -strict-sequence -c src/digest_cache.mli
- ocamlc.opt -w +L -w +R -w +Z -I src -I plugin-lib -I bin -I +unix -safe-string -bin-annot -strict-sequence -c src/digest_cache.ml
- ocamlc.opt -w +L -w +R -w +Z -I src -I plugin-lib -I bin -I +unix -safe-string -bin-annot -strict-sequence -c src/resource.mli
- ocamlc.opt -w +L -w +R -w +Z -I src -I plugin-lib -I bin -I +unix -safe-string -bin-annot -strict-sequence -c src/resource.ml
- ocamlc.opt -w +L -w +R -w +Z -I src -I plugin-lib -I bin -I +unix -safe-string -bin-annot -strict-sequence -c src/rule.mli
- ocamlc.opt -w +L -w +R -w +Z -I src -I plugin-lib -I bin -I +unix -safe-string -bin-annot -strict-sequence -c src/rule.ml
- ocamlc.opt -w +L -w +R -w +Z -I src -I plugin-lib -I bin -I +unix -safe-string -bin-annot -strict-sequence -c src/solver.mli
- ocamlc.opt -w +L -w +R -w +Z -I src -I plugin-lib -I bin -I +unix -safe-string -bin-annot -strict-sequence -c src/solver.ml
- ocamlc.opt -w +L -w +R -w +Z -I src -I plugin-lib -I bin -I +unix -safe-string -bin-annot -strict-sequence -c src/report.mli
- ocamlc.opt -w +L -w +R -w +Z -I src -I plugin-lib -I bin -I +unix -safe-string -bin-annot -strict-sequence -c src/report.ml
- ocamlc.opt -w +L -w +R -w +Z -I src -I plugin-lib -I bin -I +unix -safe-string -bin-annot -strict-sequence -c src/tools.mli
- ocamlc.opt -w +L -w +R -w +Z -I src -I plugin-lib -I bin -I +unix -safe-string -bin-annot -strict-sequence -c src/tools.ml
- ocamlc.opt -w +L -w +R -w +Z -I src -I plugin-lib -I bin -I +unix -safe-string -bin-annot -strict-sequence -c src/fda.mli
- ocamlc.opt -w +L -w +R -w +Z -I src -I plugin-lib -I bin -I +unix -safe-string -bin-annot -strict-sequence -c src/fda.ml
- ocamlc.opt -w +L -w +R -w +Z -I src -I plugin-lib -I bin -I +unix -safe-string -bin-annot -strict-sequence -c src/findlib.mli
- ocamlc.opt -w +L -w +R -w +Z -I src -I plugin-lib -I bin -I +unix -safe-string -bin-annot -strict-sequence -c src/findlib.ml
- ocamlc.opt -w +L -w +R -w +Z -I src -I plugin-lib -I bin -I +unix -safe-string -bin-annot -strict-sequence -c src/ocaml_arch.mli
- ocamlc.opt -w +L -w +R -w +Z -I src -I plugin-lib -I bin -I +unix -safe-string -bin-annot -strict-sequence -c src/ocaml_arch.ml
- ocamlc.opt -w +L -w +R -w +Z -I src -I plugin-lib -I bin -I +unix -safe-string -bin-annot -strict-sequence -c src/ocaml_utils.mli
- ocamlc.opt -w +L -w +R -w +Z -I src -I plugin-lib -I bin -I +unix -safe-string -bin-annot -strict-sequence -c src/ocaml_utils.ml
- ocamlc.opt -w +L -w +R -w +Z -I src -I plugin-lib -I bin -I +unix -safe-string -bin-annot -strict-sequence -c src/ocaml_dependencies.mli
- ocamlc.opt -w +L -w +R -w +Z -I src -I plugin-lib -I bin -I +unix -safe-string -bin-annot -strict-sequence -c src/ocaml_dependencies.ml
- ocamlc.opt -w +L -w +R -w +Z -I src -I plugin-lib -I bin -I +unix -safe-string -bin-annot -strict-sequence -c src/ocaml_compiler.mli
- ocamlc.opt -w +L -w +R -w +Z -I src -I plugin-lib -I bin -I +unix -safe-string -bin-annot -strict-sequence -c src/ocaml_compiler.ml
- ocamlc.opt -w +L -w +R -w +Z -I src -I plugin-lib -I bin -I +unix -safe-string -bin-annot -strict-sequence -c src/ocaml_tools.mli
- ocamlc.opt -w +L -w +R -w +Z -I src -I plugin-lib -I bin -I +unix -safe-string -bin-annot -strict-sequence -c src/ocaml_tools.ml
- ocamlc.opt -w +L -w +R -w +Z -I src -I plugin-lib -I bin -I +unix -safe-string -bin-annot -strict-sequence -c src/ocaml_specific.mli
- ocamlc.opt -w +L -w +R -w +Z -I src -I plugin-lib -I bin -I +unix -safe-string -bin-annot -strict-sequence -c src/ocaml_specific.ml
- ocamlc.opt -w +L -w +R -w +Z -I src -I plugin-lib -I bin -I +unix -safe-string -bin-annot -strict-sequence -c src/exit_codes.mli
- ocamlc.opt -w +L -w +R -w +Z -I src -I plugin-lib -I bin -I +unix -safe-string -bin-annot -strict-sequence -c src/exit_codes.ml
- ocamlc.opt -w +L -w +R -w +Z -I src -I plugin-lib -I bin -I +unix -safe-string -bin-annot -strict-sequence -c src/plugin.mli
- ocamlc.opt -w +L -w +R -w +Z -I src -I plugin-lib -I bin -I +unix -safe-string -bin-annot -strict-sequence -c src/plugin.ml
- ocamlc.opt -w +L -w +R -w +Z -I src -I plugin-lib -I bin -I +unix -safe-string -bin-annot -strict-sequence -c src/hooks.mli
- ocamlc.opt -w +L -w +R -w +Z -I src -I plugin-lib -I bin -I +unix -safe-string -bin-annot -strict-sequence -c src/hooks.ml
- ocamlc.opt -w +L -w +R -w +Z -I src -I plugin-lib -I bin -I +unix -safe-string -bin-annot -strict-sequence -c src/main.mli
- ocamlc.opt -w +L -w +R -w +Z -I src -I plugin-lib -I bin -I +unix -safe-string -bin-annot -strict-sequence -c src/main.ml
- mkdir -p tmp
- ocamlc.opt -pack src/const.cmo src/loc.cmo src/discard_printf.cmo src/signatures.cmi src/my_std.cmo src/my_unix.cmo src/tags.cmo src/display.cmo src/log.cmo src/shell.cmo src/bool.cmo src/glob_ast.cmo src/glob_lexer.cmo src/glob.cmo src/lexers.cmo src/param_tags.cmo src/command.cmo src/ocamlbuild_config.cmo src/ocamlbuild_where.cmo src/slurp.cmo src/options.cmo src/pathname.cmo src/configuration.cmo src/flags.cmo src/hygiene.cmo src/digest_cache.cmo src/resource.cmo src/rule.cmo src/solver.cmo src/report.cmo src/tools.cmo src/fda.cmo src/findlib.cmo src/ocaml_arch.cmo src/ocaml_utils.cmo src/ocaml_dependencies.cmo src/ocaml_compiler.cmo src/ocaml_tools.cmo src/ocaml_specific.cmo src/exit_codes.cmo src/plugin.cmo src/hooks.cmo src/main.cmo -o tmp/ocamlbuild_pack.cmo
- mv tmp/ocamlbuild_pack.cmi src/ocamlbuild_pack.cmi
- mv tmp/ocamlbuild_pack.cmo src/ocamlbuild_pack.cmo
- ocamlc.opt -w +L -w +R -w +Z -I src -I plugin-lib -I bin -I +unix -safe-string -bin-annot -strict-sequence -c plugin-lib/ocamlbuild_plugin.mli
- ocamlc.opt -w +L -w +R -w +Z -I src -I plugin-lib -I bin -I +unix -safe-string -bin-annot -strict-sequence -c plugin-lib/ocamlbuild_plugin.ml
- ocamlc.opt -w +L -w +R -w +Z -I src -I plugin-lib -I bin -I +unix -safe-string -bin-annot -strict-sequence -c plugin-lib/ocamlbuild_executor.mli
- ocamlc.opt -w +L -w +R -w +Z -I src -I plugin-lib -I bin -I +unix -safe-string -bin-annot -strict-sequence -c plugin-lib/ocamlbuild_executor.ml
- ocamlc.opt -w +L -w +R -w +Z -I src -I plugin-lib -I bin -I +unix -safe-string -bin-annot -strict-sequence -c plugin-lib/ocamlbuild_unix_plugin.mli
- ocamlc.opt -w +L -w +R -w +Z -I src -I plugin-lib -I bin -I +unix -safe-string -bin-annot -strict-sequence -c plugin-lib/ocamlbuild_unix_plugin.ml
- ocamlc.opt -w +L -w +R -w +Z -I src -I plugin-lib -I bin -I +unix -safe-string -bin-annot -strict-sequence -c bin/ocamlbuild.mli
- ocamlc.opt -w +L -w +R -w +Z -I src -I plugin-lib -I bin -I +unix -safe-string -bin-annot -strict-sequence -c bin/ocamlbuild.ml
- ocamlc.opt -I +unix -I src -o ocamlbuild.byte unix.cma src/ocamlbuild_pack.cmo plugin-lib/ocamlbuild_plugin.cmo plugin-lib/ocamlbuild_executor.cmo plugin-lib/ocamlbuild_unix_plugin.cmo bin/ocamlbuild.cmo
- ocamlc.opt -a -o plugin-lib/ocamlbuildlib.cma src/ocamlbuild_pack.cmo plugin-lib/ocamlbuild_plugin.cmo plugin-lib/ocamlbuild_executor.cmo plugin-lib/ocamlbuild_unix_plugin.cmo
- ocamlopt.opt -for-pack Ocamlbuild_pack -w +L -w +R -w +Z -I src -I plugin-lib -I bin -I +unix -safe-string -bin-annot -strict-sequence -c src/const.ml
- ocamlopt.opt -for-pack Ocamlbuild_pack -w +L -w +R -w +Z -I src -I plugin-lib -I bin -I +unix -safe-string -bin-annot -strict-sequence -c src/loc.ml
- ocamlopt.opt -for-pack Ocamlbuild_pack -w +L -w +R -w +Z -I src -I plugin-lib -I bin -I +unix -safe-string -bin-annot -strict-sequence -c src/discard_printf.ml
- ocamlopt.opt -for-pack Ocamlbuild_pack -w +L -w +R -w +Z -I src -I plugin-lib -I bin -I +unix -safe-string -bin-annot -strict-sequence -c src/my_std.ml
- ocamlopt.opt -for-pack Ocamlbuild_pack -w +L -w +R -w +Z -I src -I plugin-lib -I bin -I +unix -safe-string -bin-annot -strict-sequence -c src/my_unix.ml
- ocamlopt.opt -for-pack Ocamlbuild_pack -w +L -w +R -w +Z -I src -I plugin-lib -I bin -I +unix -safe-string -bin-annot -strict-sequence -c src/tags.ml
- ocamlopt.opt -for-pack Ocamlbuild_pack -w +L -w +R -w +Z -I src -I plugin-lib -I bin -I +unix -safe-string -bin-annot -strict-sequence -c src/display.ml
- ocamlopt.opt -for-pack Ocamlbuild_pack -w +L -w +R -w +Z -I src -I plugin-lib -I bin -I +unix -safe-string -bin-annot -strict-sequence -c src/log.ml
- ocamlopt.opt -for-pack Ocamlbuild_pack -w +L -w +R -w +Z -I src -I plugin-lib -I bin -I +unix -safe-string -bin-annot -strict-sequence -c src/shell.ml
- ocamlopt.opt -for-pack Ocamlbuild_pack -w +L -w +R -w +Z -I src -I plugin-lib -I bin -I +unix -safe-string -bin-annot -strict-sequence -c src/bool.ml
- ocamlopt.opt -for-pack Ocamlbuild_pack -w +L -w +R -w +Z -I src -I plugin-lib -I bin -I +unix -safe-string -bin-annot -strict-sequence -c src/glob_ast.ml
- ocamlopt.opt -for-pack Ocamlbuild_pack -w +L -w +R -w +Z -I src -I plugin-lib -I bin -I +unix -safe-string -bin-annot -strict-sequence -c src/glob_lexer.ml
- ocamlopt.opt -for-pack Ocamlbuild_pack -w +L -w +R -w +Z -I src -I plugin-lib -I bin -I +unix -safe-string -bin-annot -strict-sequence -c src/glob.ml
- ocamlopt.opt -for-pack Ocamlbuild_pack -w +L -w +R -w +Z -I src -I plugin-lib -I bin -I +unix -safe-string -bin-annot -strict-sequence -c src/lexers.ml
- ocamlopt.opt -for-pack Ocamlbuild_pack -w +L -w +R -w +Z -I src -I plugin-lib -I bin -I +unix -safe-string -bin-annot -strict-sequence -c src/param_tags.ml
- ocamlopt.opt -for-pack Ocamlbuild_pack -w +L -w +R -w +Z -I src -I plugin-lib -I bin -I +unix -safe-string -bin-annot -strict-sequence -c src/command.ml
- ocamlopt.opt -for-pack Ocamlbuild_pack -w +L -w +R -w +Z -I src -I plugin-lib -I bin -I +unix -safe-string -bin-annot -strict-sequence -c src/ocamlbuild_config.ml
- ocamlopt.opt -for-pack Ocamlbuild_pack -w +L -w +R -w +Z -I src -I plugin-lib -I bin -I +unix -safe-string -bin-annot -strict-sequence -c src/ocamlbuild_where.ml
- ocamlopt.opt -for-pack Ocamlbuild_pack -w +L -w +R -w +Z -I src -I plugin-lib -I bin -I +unix -safe-string -bin-annot -strict-sequence -c src/slurp.ml
- ocamlopt.opt -for-pack Ocamlbuild_pack -w +L -w +R -w +Z -I src -I plugin-lib -I bin -I +unix -safe-string -bin-annot -strict-sequence -c src/options.ml
- ocamlopt.opt -for-pack Ocamlbuild_pack -w +L -w +R -w +Z -I src -I plugin-lib -I bin -I +unix -safe-string -bin-annot -strict-sequence -c src/pathname.ml
- ocamlopt.opt -for-pack Ocamlbuild_pack -w +L -w +R -w +Z -I src -I plugin-lib -I bin -I +unix -safe-string -bin-annot -strict-sequence -c src/configuration.ml
- ocamlopt.opt -for-pack Ocamlbuild_pack -w +L -w +R -w +Z -I src -I plugin-lib -I bin -I +unix -safe-string -bin-annot -strict-sequence -c src/flags.ml
- ocamlopt.opt -for-pack Ocamlbuild_pack -w +L -w +R -w +Z -I src -I plugin-lib -I bin -I +unix -safe-string -bin-annot -strict-sequence -c src/hygiene.ml
- ocamlopt.opt -for-pack Ocamlbuild_pack -w +L -w +R -w +Z -I src -I plugin-lib -I bin -I +unix -safe-string -bin-annot -strict-sequence -c src/digest_cache.ml
- ocamlopt.opt -for-pack Ocamlbuild_pack -w +L -w +R -w +Z -I src -I plugin-lib -I bin -I +unix -safe-string -bin-annot -strict-sequence -c src/resource.ml
- ocamlopt.opt -for-pack Ocamlbuild_pack -w +L -w +R -w +Z -I src -I plugin-lib -I bin -I +unix -safe-string -bin-annot -strict-sequence -c src/rule.ml
- ocamlopt.opt -for-pack Ocamlbuild_pack -w +L -w +R -w +Z -I src -I plugin-lib -I bin -I +unix -safe-string -bin-annot -strict-sequence -c src/solver.ml
- ocamlopt.opt -for-pack Ocamlbuild_pack -w +L -w +R -w +Z -I src -I plugin-lib -I bin -I +unix -safe-string -bin-annot -strict-sequence -c src/report.ml
- ocamlopt.opt -for-pack Ocamlbuild_pack -w +L -w +R -w +Z -I src -I plugin-lib -I bin -I +unix -safe-string -bin-annot -strict-sequence -c src/tools.ml
- ocamlopt.opt -for-pack Ocamlbuild_pack -w +L -w +R -w +Z -I src -I plugin-lib -I bin -I +unix -safe-string -bin-annot -strict-sequence -c src/fda.ml
- ocamlopt.opt -for-pack Ocamlbuild_pack -w +L -w +R -w +Z -I src -I plugin-lib -I bin -I +unix -safe-string -bin-annot -strict-sequence -c src/findlib.ml
- ocamlopt.opt -for-pack Ocamlbuild_pack -w +L -w +R -w +Z -I src -I plugin-lib -I bin -I +unix -safe-string -bin-annot -strict-sequence -c src/ocaml_arch.ml
- ocamlopt.opt -for-pack Ocamlbuild_pack -w +L -w +R -w +Z -I src -I plugin-lib -I bin -I +unix -safe-string -bin-annot -strict-sequence -c src/ocaml_utils.ml
- ocamlopt.opt -for-pack Ocamlbuild_pack -w +L -w +R -w +Z -I src -I plugin-lib -I bin -I +unix -safe-string -bin-annot -strict-sequence -c src/ocaml_dependencies.ml
- ocamlopt.opt -for-pack Ocamlbuild_pack -w +L -w +R -w +Z -I src -I plugin-lib -I bin -I +unix -safe-string -bin-annot -strict-sequence -c src/ocaml_compiler.ml
- ocamlopt.opt -for-pack Ocamlbuild_pack -w +L -w +R -w +Z -I src -I plugin-lib -I bin -I +unix -safe-string -bin-annot -strict-sequence -c src/ocaml_tools.ml
- ocamlopt.opt -for-pack Ocamlbuild_pack -w +L -w +R -w +Z -I src -I plugin-lib -I bin -I +unix -safe-string -bin-annot -strict-sequence -c src/ocaml_specific.ml
- ocamlopt.opt -for-pack Ocamlbuild_pack -w +L -w +R -w +Z -I src -I plugin-lib -I bin -I +unix -safe-string -bin-annot -strict-sequence -c src/exit_codes.ml
- ocamlopt.opt -for-pack Ocamlbuild_pack -w +L -w +R -w +Z -I src -I plugin-lib -I bin -I +unix -safe-string -bin-annot -strict-sequence -c src/plugin.ml
- ocamlopt.opt -for-pack Ocamlbuild_pack -w +L -w +R -w +Z -I src -I plugin-lib -I bin -I +unix -safe-string -bin-annot -strict-sequence -c src/hooks.ml
- ocamlopt.opt -for-pack Ocamlbuild_pack -w +L -w +R -w +Z -I src -I plugin-lib -I bin -I +unix -safe-string -bin-annot -strict-sequence -c src/main.ml
- mkdir -p tmp
- ocamlopt.opt -pack src/const.cmx src/loc.cmx src/discard_printf.cmx src/signatures.cmi src/my_std.cmx src/my_unix.cmx src/tags.cmx src/display.cmx src/log.cmx src/shell.cmx src/bool.cmx src/glob_ast.cmx src/glob_lexer.cmx src/glob.cmx src/lexers.cmx src/param_tags.cmx src/command.cmx src/ocamlbuild_config.cmx src/ocamlbuild_where.cmx src/slurp.cmx src/options.cmx src/pathname.cmx src/configuration.cmx src/flags.cmx src/hygiene.cmx src/digest_cache.cmx src/resource.cmx src/rule.cmx src/solver.cmx src/report.cmx src/tools.cmx src/fda.cmx src/findlib.cmx src/ocaml_arch.cmx src/ocaml_utils.cmx src/ocaml_dependencies.cmx src/ocaml_compiler.cmx src/ocaml_tools.cmx src/ocaml_specific.cmx src/exit_codes.cmx src/plugin.cmx src/hooks.cmx src/main.cmx -o tmp/ocamlbuild_pack.cmx
- mv tmp/ocamlbuild_pack.cmx src/ocamlbuild_pack.cmx
- mv tmp/ocamlbuild_pack.o src/ocamlbuild_pack.o
- ocamlopt.opt -w +L -w +R -w +Z -I src -I plugin-lib -I bin -I +unix -safe-string -bin-annot -strict-sequence -c plugin-lib/ocamlbuild_plugin.ml
- ocamlopt.opt -w +L -w +R -w +Z -I src -I plugin-lib -I bin -I +unix -safe-string -bin-annot -strict-sequence -c plugin-lib/ocamlbuild_executor.ml
- ocamlopt.opt -w +L -w +R -w +Z -I src -I plugin-lib -I bin -I +unix -safe-string -bin-annot -strict-sequence -c plugin-lib/ocamlbuild_unix_plugin.ml
- ocamlopt.opt -w +L -w +R -w +Z -I src -I plugin-lib -I bin -I +unix -safe-string -bin-annot -strict-sequence -c bin/ocamlbuild.ml
- ocamlopt.opt -I +unix -I src -o ocamlbuild.native unix.cmxa src/ocamlbuild_pack.cmx plugin-lib/ocamlbuild_plugin.cmx plugin-lib/ocamlbuild_executor.cmx plugin-lib/ocamlbuild_unix_plugin.cmx bin/ocamlbuild.cmx
- ocamlopt.opt -a -o plugin-lib/ocamlbuildlib.cmxa src/ocamlbuild_pack.cmx plugin-lib/ocamlbuild_plugin.cmx plugin-lib/ocamlbuild_executor.cmx plugin-lib/ocamlbuild_unix_plugin.cmx
- ocamlc.opt src/ocamlbuild_pack.cmo -I src man/options_man.ml -o man/options_man.byte
- ./man/options_man.byte > man/ocamlbuild.options.1
- cat man/ocamlbuild.header.1 man/ocamlbuild.options.1 man/ocamlbuild.footer.1 > man/ocamlbuild.1
- /usr/bin/make ocamlbuild.install
- make[1]: Entering directory '/home/opam/.opam/4.12/.opam-switch/build/ocamlbuild.0.14.3'
- rm -f ocamlbuild.install
- touch ocamlbuild.install
- /usr/bin/make install-bin-opam
- make[2]: Entering directory '/home/opam/.opam/4.12/.opam-switch/build/ocamlbuild.0.14.3'
- echo 'bin: [' >> ocamlbuild.install
- echo '  "ocamlbuild.byte" {"ocamlbuild.byte"}' >> ocamlbuild.install
- echo '  "ocamlbuild.native" {"ocamlbuild.native"}' >> ocamlbuild.install
- echo '  "ocamlbuild.native" {"ocamlbuild"}' >> ocamlbuild.install
- echo ']' >> ocamlbuild.install
- echo >> ocamlbuild.install
- make[2]: Leaving directory '/home/opam/.opam/4.12/.opam-switch/build/ocamlbuild.0.14.3'
- /usr/bin/make install-lib-opam
- make[2]: Entering directory '/home/opam/.opam/4.12/.opam-switch/build/ocamlbuild.0.14.3'
- echo 'lib: [' >> ocamlbuild.install
- /usr/bin/make install-lib-basics-opam
- make[3]: Entering directory '/home/opam/.opam/4.12/.opam-switch/build/ocamlbuild.0.14.3'
- echo '  "ocamlbuild.opam" {"opam"}' >> ocamlbuild.install
- echo '  "META"' >> ocamlbuild.install
- for lib in src/signatures.mli src/signatures.cmi src/signatures.cmti; do \
-   echo "  \"$lib\" {\"$(basename $lib)\"}" >> ocamlbuild.install; \
- done
- make[3]: Leaving directory '/home/opam/.opam/4.12/.opam-switch/build/ocamlbuild.0.14.3'
- /usr/bin/make install-lib-byte-opam
- make[3]: Entering directory '/home/opam/.opam/4.12/.opam-switch/build/ocamlbuild.0.14.3'
- for lib in plugin-lib/ocamlbuildlib.cma bin/ocamlbuild.cmo src/ocamlbuild_pack.cmi plugin-lib/ocamlbuild_plugin.cmi plugin-lib/ocamlbuild_executor.cmi plugin-lib/ocamlbuild_unix_plugin.cmi; do \
-   echo "  \"$lib\" {\"$(basename $lib)\"}" >> ocamlbuild.install; \
- done
- make[3]: Leaving directory '/home/opam/.opam/4.12/.opam-switch/build/ocamlbuild.0.14.3'
- /usr/bin/make install-lib-native-opam
- make[3]: Entering directory '/home/opam/.opam/4.12/.opam-switch/build/ocamlbuild.0.14.3'
- for lib in plugin-lib/ocamlbuildlib.cmxa plugin-lib/ocamlbuildlib.a bin/ocamlbuild.cmx bin/ocamlbuild.o src/ocamlbuild_pack.cmx plugin-lib/ocamlbuild_plugin.cmx plugin-lib/ocamlbuild_executor.cmx plugin-lib/ocamlbuild_unix_plugin.cmx plugin-lib/ocamlbuild_plugin.o plugin-lib/ocamlbuild_executor.o plugin-lib/ocamlbuild_unix_plugin.o; do \
-   echo "  \"$lib\" {\"$(basename $lib)\"}" >> ocamlbuild.install; \
- done
- make[3]: Leaving directory '/home/opam/.opam/4.12/.opam-switch/build/ocamlbuild.0.14.3'
- echo ']' >> ocamlbuild.install
- echo >> ocamlbuild.install
- make[2]: Leaving directory '/home/opam/.opam/4.12/.opam-switch/build/ocamlbuild.0.14.3'
- /usr/bin/make install-man-opam
- make[2]: Entering directory '/home/opam/.opam/4.12/.opam-switch/build/ocamlbuild.0.14.3'
- echo 'man: [' >> ocamlbuild.install
- echo '  "man/ocamlbuild.1" {"man1/ocamlbuild.1"}' >> ocamlbuild.install
- echo ']' >> ocamlbuild.install
- echo >> ocamlbuild.install
- make[2]: Leaving directory '/home/opam/.opam/4.12/.opam-switch/build/ocamlbuild.0.14.3'
- /usr/bin/make install-doc-opam
- make[2]: Entering directory '/home/opam/.opam/4.12/.opam-switch/build/ocamlbuild.0.14.3'
- echo 'doc: [' >> ocamlbuild.install
- echo '  "LICENSE"' >> ocamlbuild.install
- echo '  "Changes"' >> ocamlbuild.install
- echo '  "Readme.md"' >> ocamlbuild.install
- echo ']' >> ocamlbuild.install
- make[2]: Leaving directory '/home/opam/.opam/4.12/.opam-switch/build/ocamlbuild.0.14.3'
- make[1]: Leaving directory '/home/opam/.opam/4.12/.opam-switch/build/ocamlbuild.0.14.3'
-> compiled  ocamlbuild.0.14.3
Processing 106/147: [lwt: dune build] [menhir: dune build] [ppxlib: dune build] [stdune: rm]
-> installed ocamlbuild.0.14.3
Processing 107/147: [lwt: dune build] [menhir: dune build] [ppxlib: dune build] [stdune: rm]
Processing 108/147: [lwt: dune build] [menhir: dune build] [ppxlib: dune build] [stdune: rm] [topkg: ocaml build]
-> compiled  lwt.5.7.0
Processing 108/147: [menhir: dune build] [ppxlib: dune build] [stdune: rm] [topkg: ocaml build]
-> installed lwt.5.7.0
Processing 109/147: [menhir: dune build] [ppxlib: dune build] [stdune: rm] [topkg: ocaml build]
Processing 109/147: [menhir: dune build] [ppxlib: dune build] [stdune: dune build] [topkg: ocaml build]
-> compiled  stdune.3.13.0
Processing 109/147: [menhir: dune build] [ppxlib: dune build] [topkg: ocaml build]
-> installed stdune.3.13.0
Processing 110/147: [menhir: dune build] [ppxlib: dune build] [topkg: ocaml build]
Processing 111/147: [dune-private-libs: rm] [menhir: dune build] [ppxlib: dune build] [topkg: ocaml build]
Processing 111/147: [dune-private-libs: dune build] [menhir: dune build] [ppxlib: dune build] [topkg: ocaml build]
- ocamlfind ocamldep -modules src/topkg.ml > src/topkg.ml.depends
- ocamlfind ocamldep -modules src/topkg.mli > src/topkg.mli.depends
- ocamlfind ocamlc -c -g -bin-annot -safe-string -I src -I src-bin -I src-care -I test -o src/topkg.cmi src/topkg.mli
- ocamlfind ocamldep -modules src/topkg_build.ml > src/topkg_build.ml.depends
- ocamlfind ocamldep -modules src/topkg_build.mli > src/topkg_build.mli.depends
- ocamlfind ocamldep -modules src/topkg_cmd.mli > src/topkg_cmd.mli.depends
- ocamlfind ocamldep -modules src/topkg_fpath.mli > src/topkg_fpath.mli.depends
- ocamlfind ocamlc -c -g -bin-annot -safe-string -I src -I src-bin -I src-care -I test -o src/topkg_fpath.cmi src/topkg_fpath.mli
- ocamlfind ocamldep -modules src/topkg_codec.mli > src/topkg_codec.mli.depends
- ocamlfind ocamlc -c -g -bin-annot -safe-string -I src -I src-bin -I src-care -I test -o src/topkg_cmd.cmi src/topkg_cmd.mli
- ocamlfind ocamldep -modules src/topkg_result.mli > src/topkg_result.mli.depends
- ocamlfind ocamlc -c -g -bin-annot -safe-string -I src -I src-bin -I src-care -I test -o src/topkg_result.cmi src/topkg_result.mli
- ocamlfind ocamldep -modules src/topkg_conf.mli > src/topkg_conf.mli.depends
- ocamlfind ocamlc -c -g -bin-annot -safe-string -I src -I src-bin -I src-care -I test -o src/topkg_codec.cmi src/topkg_codec.mli
- ocamlfind ocamlc -c -g -bin-annot -safe-string -I src -I src-bin -I src-care -I test -o src/topkg_conf.cmi src/topkg_conf.mli
- ocamlfind ocamlc -c -g -bin-annot -safe-string -I src -I src-bin -I src-care -I test -o src/topkg_build.cmi src/topkg_build.mli
- ocamlfind ocamldep -modules src/topkg_cmd.ml > src/topkg_cmd.ml.depends
- ocamlfind ocamldep -modules src/topkg_fpath.ml > src/topkg_fpath.ml.depends
- ocamlfind ocamldep -modules src/topkg_string.ml > src/topkg_string.ml.depends
- ocamlfind ocamldep -modules src/topkg_string.mli > src/topkg_string.mli.depends
- ocamlfind ocamlc -c -g -bin-annot -safe-string -I src -I src-bin -I src-care -I test -o src/topkg_string.cmi src/topkg_string.mli
- ocamlfind ocamlopt -c -g -bin-annot -safe-string -I src -I src-bin -I src-care -I test -o src/topkg_string.cmx src/topkg_string.ml
- ocamlfind ocamlopt -c -g -bin-annot -safe-string -I src -I src-bin -I src-care -I test -o src/topkg_fpath.cmx src/topkg_fpath.ml
- ocamlfind ocamldep -modules src/topkg_codec.ml > src/topkg_codec.ml.depends
- ocamlfind ocamlopt -c -g -bin-annot -safe-string -I src -I src-bin -I src-care -I test -o src/topkg_cmd.cmx src/topkg_cmd.ml
- ocamlfind ocamldep -modules src/topkg_os.ml > src/topkg_os.ml.depends
- ocamlfind ocamldep -modules src/topkg_os.mli > src/topkg_os.mli.depends
- ocamlfind ocamlc -c -g -bin-annot -safe-string -I src -I src-bin -I src-care -I test -o src/topkg_os.cmi src/topkg_os.mli
- ocamlfind ocamldep -modules src/topkg_log.ml > src/topkg_log.ml.depends
- ocamlfind ocamldep -modules src/topkg_log.mli > src/topkg_log.mli.depends
- ocamlfind ocamlc -c -g -bin-annot -safe-string -I src -I src-bin -I src-care -I test -o src/topkg_log.cmi src/topkg_log.mli
- ocamlfind ocamldep -modules src/topkg_result.ml > src/topkg_result.ml.depends
- ocamlfind ocamlopt -c -g -bin-annot -safe-string -I src -I src-bin -I src-care -I test -o src/topkg_result.cmx src/topkg_result.ml
- ocamlfind ocamlopt -c -g -bin-annot -safe-string -I src -I src-bin -I src-care -I test -o src/topkg_log.cmx src/topkg_log.ml
- ocamlfind ocamlopt -c -g -bin-annot -safe-string -I src -I src-bin -I src-care -I test -o src/topkg_os.cmx src/topkg_os.ml
- ocamlfind ocamldep -modules src/topkg_conf.ml > src/topkg_conf.ml.depends
- ocamlfind ocamlopt -c -g -bin-annot -safe-string -I src -I src-bin -I src-care -I test -o src/topkg_codec.cmx src/topkg_codec.ml
- ocamlfind ocamldep -modules src/topkg_vcs.ml > src/topkg_vcs.ml.depends
- ocamlfind ocamldep -modules src/topkg_vcs.mli > src/topkg_vcs.mli.depends
- ocamlfind ocamlc -c -g -bin-annot -safe-string -I src -I src-bin -I src-care -I test -o src/topkg_vcs.cmi src/topkg_vcs.mli
- ocamlfind ocamlopt -c -g -bin-annot -safe-string -I src -I src-bin -I src-care -I test -o src/topkg_vcs.cmx src/topkg_vcs.ml
- ocamlfind ocamlopt -c -g -bin-annot -safe-string -I src -I src-bin -I src-care -I test -o src/topkg_conf.cmx src/topkg_conf.ml
- ocamlfind ocamldep -modules src/topkg_distrib.ml > src/topkg_distrib.ml.depends
- ocamlfind ocamldep -modules src/topkg_distrib.mli > src/topkg_distrib.mli.depends
- ocamlfind ocamlc -c -g -bin-annot -safe-string -I src -I src-bin -I src-care -I test -o src/topkg_distrib.cmi src/topkg_distrib.mli
- ocamlfind ocamldep -modules src/topkg_opam.ml > src/topkg_opam.ml.depends
- ocamlfind ocamldep -modules src/topkg_opam.mli > src/topkg_opam.mli.depends
- ocamlfind ocamlc -c -g -bin-annot -safe-string -I src -I src-bin -I src-care -I test -o src/topkg_opam.cmi src/topkg_opam.mli
- ocamlfind ocamlopt -c -g -bin-annot -safe-string -I src -I src-bin -I src-care -I test -o src/topkg_opam.cmx src/topkg_opam.ml
- ocamlfind ocamldep -modules src/topkg_fexts.ml > src/topkg_fexts.ml.depends
- ocamlfind ocamldep -modules src/topkg_fexts.mli > src/topkg_fexts.mli.depends
- ocamlfind ocamlc -c -g -bin-annot -safe-string -I src -I src-bin -I src-care -I test -o src/topkg_fexts.cmi src/topkg_fexts.mli
- ocamlfind ocamldep -modules src/topkg_install.ml > src/topkg_install.ml.depends
- ocamlfind ocamldep -modules src/topkg_install.mli > src/topkg_install.mli.depends
- ocamlfind ocamldep -modules src/topkg_test.mli > src/topkg_test.mli.depends
- ocamlfind ocamlc -c -g -bin-annot -safe-string -I src -I src-bin -I src-care -I test -o src/topkg_test.cmi src/topkg_test.mli
- ocamlfind ocamlc -c -g -bin-annot -safe-string -I src -I src-bin -I src-care -I test -o src/topkg_install.cmi src/topkg_install.mli
- ocamlfind ocamlopt -c -g -bin-annot -safe-string -I src -I src-bin -I src-care -I test -o src/topkg_fexts.cmx src/topkg_fexts.ml
- ocamlfind ocamldep -modules src/topkg_test.ml > src/topkg_test.ml.depends
- ocamlfind ocamlopt -c -g -bin-annot -safe-string -I src -I src-bin -I src-care -I test -o src/topkg_test.cmx src/topkg_test.ml
- ocamlfind ocamldep -modules src/topkg_ipc.ml > src/topkg_ipc.ml.depends
- ocamlfind ocamldep -modules src/topkg_ipc.mli > src/topkg_ipc.mli.depends
- ocamlfind ocamldep -modules src/topkg_pkg.mli > src/topkg_pkg.mli.depends
- ocamlfind ocamldep -modules src/topkg_publish.mli > src/topkg_publish.mli.depends
- ocamlfind ocamlc -c -g -bin-annot -safe-string -I src -I src-bin -I src-care -I test -o src/topkg_publish.cmi src/topkg_publish.mli
- ocamlfind ocamlc -c -g -bin-annot -safe-string -I src -I src-bin -I src-care -I test -o src/topkg_pkg.cmi src/topkg_pkg.mli
- ocamlfind ocamlc -c -g -bin-annot -safe-string -I src -I src-bin -I src-care -I test -o src/topkg_ipc.cmi src/topkg_ipc.mli
- ocamlfind ocamldep -modules src/topkg_pkg.ml > src/topkg_pkg.ml.depends
- ocamlfind ocamlopt -c -g -bin-annot -safe-string -I src -I src-bin -I src-care -I test -o src/topkg_build.cmx src/topkg_build.ml
- ocamlfind ocamlopt -c -g -bin-annot -safe-string -I src -I src-bin -I src-care -I test -o src/topkg_distrib.cmx src/topkg_distrib.ml
- ocamlfind ocamlopt -c -g -bin-annot -safe-string -I src -I src-bin -I src-care -I test -o src/topkg_install.cmx src/topkg_install.ml
- ocamlfind ocamldep -modules src/topkg_publish.ml > src/topkg_publish.ml.depends
- ocamlfind ocamlopt -c -g -bin-annot -safe-string -I src -I src-bin -I src-care -I test -o src/topkg_publish.cmx src/topkg_publish.ml
- ocamlfind ocamlopt -c -g -bin-annot -safe-string -I src -I src-bin -I src-care -I test -o src/topkg_pkg.cmx src/topkg_pkg.ml
- ocamlfind ocamldep -modules src/topkg_main.ml > src/topkg_main.ml.depends
- ocamlfind ocamldep -modules src/topkg_main.mli > src/topkg_main.mli.depends
- ocamlfind ocamlc -c -g -bin-annot -safe-string -I src -I src-bin -I src-care -I test -o src/topkg_main.cmi src/topkg_main.mli
- ocamlfind ocamlopt -c -g -bin-annot -safe-string -I src -I src-bin -I src-care -I test -o src/topkg_ipc.cmx src/topkg_ipc.ml
- ocamlfind ocamlopt -c -g -bin-annot -safe-string -I src -I src-bin -I src-care -I test -o src/topkg_main.cmx src/topkg_main.ml
- ocamlfind ocamlopt -c -g -bin-annot -safe-string -I src -I src-bin -I src-care -I test -o src/topkg.cmx src/topkg.ml
- ocamlfind ocamlopt -a -I src src/topkg_string.cmx src/topkg_fpath.cmx src/topkg_cmd.cmx src/topkg_result.cmx src/topkg_log.cmx src/topkg_os.cmx src/topkg_codec.cmx src/topkg_vcs.cmx src/topkg_conf.cmx src/topkg_build.cmx src/topkg_opam.cmx src/topkg_distrib.cmx src/topkg_fexts.cmx src/topkg_test.cmx src/topkg_install.cmx src/topkg_publish.cmx src/topkg_pkg.cmx src/topkg_ipc.cmx src/topkg_main.cmx src/topkg.cmx -o src/topkg.cmxa
- ocamlfind ocamlopt -shared -linkall -I src src/topkg.cmxa -o src/topkg.cmxs
- ocamlfind ocamlc -c -g -bin-annot -safe-string -I src -I src-bin -I src-care -I test -o src/topkg.cmo src/topkg.ml
- ocamlfind ocamlc -c -g -bin-annot -safe-string -I src -I src-bin -I src-care -I test -o src/topkg_build.cmo src/topkg_build.ml
- ocamlfind ocamlc -c -g -bin-annot -safe-string -I src -I src-bin -I src-care -I test -o src/topkg_cmd.cmo src/topkg_cmd.ml
- ocamlfind ocamlc -c -g -bin-annot -safe-string -I src -I src-bin -I src-care -I test -o src/topkg_codec.cmo src/topkg_codec.ml
- ocamlfind ocamlc -c -g -bin-annot -safe-string -I src -I src-bin -I src-care -I test -o src/topkg_conf.cmo src/topkg_conf.ml
- ocamlfind ocamlc -c -g -bin-annot -safe-string -I src -I src-bin -I src-care -I test -o src/topkg_distrib.cmo src/topkg_distrib.ml
- ocamlfind ocamlc -c -g -bin-annot -safe-string -I src -I src-bin -I src-care -I test -o src/topkg_fexts.cmo src/topkg_fexts.ml
- ocamlfind ocamlc -c -g -bin-annot -safe-string -I src -I src-bin -I src-care -I test -o src/topkg_fpath.cmo src/topkg_fpath.ml
- ocamlfind ocamlc -c -g -bin-annot -safe-string -I src -I src-bin -I src-care -I test -o src/topkg_install.cmo src/topkg_install.ml
- ocamlfind ocamlc -c -g -bin-annot -safe-string -I src -I src-bin -I src-care -I test -o src/topkg_ipc.cmo src/topkg_ipc.ml
- ocamlfind ocamlc -c -g -bin-annot -safe-string -I src -I src-bin -I src-care -I test -o src/topkg_log.cmo src/topkg_log.ml
- ocamlfind ocamlc -c -g -bin-annot -safe-string -I src -I src-bin -I src-care -I test -o src/topkg_main.cmo src/topkg_main.ml
- ocamlfind ocamlc -c -g -bin-annot -safe-string -I src -I src-bin -I src-care -I test -o src/topkg_opam.cmo src/topkg_opam.ml
- ocamlfind ocamlc -c -g -bin-annot -safe-string -I src -I src-bin -I src-care -I test -o src/topkg_os.cmo src/topkg_os.ml
- ocamlfind ocamlc -c -g -bin-annot -safe-string -I src -I src-bin -I src-care -I test -o src/topkg_pkg.cmo src/topkg_pkg.ml
- ocamlfind ocamlc -c -g -bin-annot -safe-string -I src -I src-bin -I src-care -I test -o src/topkg_publish.cmo src/topkg_publish.ml
- ocamlfind ocamlc -c -g -bin-annot -safe-string -I src -I src-bin -I src-care -I test -o src/topkg_result.cmo src/topkg_result.ml
- ocamlfind ocamlc -c -g -bin-annot -safe-string -I src -I src-bin -I src-care -I test -o src/topkg_string.cmo src/topkg_string.ml
- ocamlfind ocamlc -c -g -bin-annot -safe-string -I src -I src-bin -I src-care -I test -o src/topkg_test.cmo src/topkg_test.ml
- ocamlfind ocamlc -c -g -bin-annot -safe-string -I src -I src-bin -I src-care -I test -o src/topkg_vcs.cmo src/topkg_vcs.ml
- ocamlfind ocamlc -a -I src src/topkg_string.cmo src/topkg_fpath.cmo src/topkg_cmd.cmo src/topkg_result.cmo src/topkg_log.cmo src/topkg_os.cmo src/topkg_codec.cmo src/topkg_vcs.cmo src/topkg_conf.cmo src/topkg_build.cmo src/topkg_opam.cmo src/topkg_distrib.cmo src/topkg_fexts.cmo src/topkg_test.cmo src/topkg_install.cmo src/topkg_publish.cmo src/topkg_pkg.cmo src/topkg_ipc.cmo src/topkg_main.cmo src/topkg.cmo -o src/topkg.cma
- # Parallel statistics: { count(total): 2(84), max: 20, min: 2, average(total): 11.000(1.238) }
-> compiled  topkg.1.0.7
Processing 111/147: [dune-private-libs: dune build] [menhir: dune build] [ppxlib: dune build]
-> installed topkg.1.0.7
Processing 112/147: [dune-private-libs: dune build] [menhir: dune build] [ppxlib: dune build]
Processing 113/147: [dune-private-libs: dune build] [fmt: ocaml build] [menhir: dune build] [ppxlib: dune build]
Processing 114/147: [dune-private-libs: dune build] [fmt: ocaml build] [menhir: dune build] [ppxlib: dune build] [ptime: ocaml build]
Processing 115/147: [dune-private-libs: dune build] [fmt: ocaml build] [menhir: dune build] [ppxlib: dune build] [ptime: ocaml build] [uutf: ocaml build]
- ocamlfind ocamldep -modules src/uutf.ml > src/uutf.ml.depends
- ocamlfind ocamldep -modules src/uutf.mli > src/uutf.mli.depends
- ocamlfind ocamlc -c -g -bin-annot -safe-string -I src -I test -o src/uutf.cmi src/uutf.mli
- ocamlfind ocamlopt -c -g -bin-annot -safe-string -I src -I test -o src/uutf.cmx src/uutf.ml
- ocamlfind ocamlopt -a -I src src/uutf.cmx -o src/uutf.cmxa
- ocamlfind ocamlopt -shared -linkall -I src src/uutf.cmxa -o src/uutf.cmxs
- ocamlfind ocamlc -c -g -bin-annot -safe-string -I src -I test -o src/uutf.cmo src/uutf.ml
- ocamlfind ocamlc -a -I src src/uutf.cmo -o src/uutf.cma
- # No parallelism done
-> compiled  uutf.1.0.3
Processing 115/147: [dune-private-libs: dune build] [fmt: ocaml build] [menhir: dune build] [ppxlib: dune build] [ptime: ocaml build]
-> installed uutf.1.0.3
Processing 116/147: [dune-private-libs: dune build] [fmt: ocaml build] [menhir: dune build] [ppxlib: dune build] [ptime: ocaml build]
Processing 117/147: [dune-private-libs: dune build] [fmt: ocaml build] [menhir: dune build] [ppxlib: dune build] [ptime: ocaml build] [uunf: ocaml build]
- ocamlfind ocamldep -modules src/fmt.ml > src/fmt.ml.depends
- ocamlfind ocamldep -modules src/fmt.mli > src/fmt.mli.depends
- ocamlfind ocamlc -c -g -bin-annot -safe-string -I src -I test -o src/fmt.cmi src/fmt.mli
- ocamlfind ocamlopt -c -g -bin-annot -safe-string -I src -I test -o src/fmt.cmx src/fmt.ml
- ocamlfind ocamlopt -a -I src src/fmt.cmx -o src/fmt.cmxa
- ocamlfind ocamlopt -shared -linkall -I src src/fmt.cmxa -o src/fmt.cmxs
- ocamlfind ocamlc -c -g -bin-annot -safe-string -I src -I test -o src/fmt.cmo src/fmt.ml
- ocamlfind ocamlc -a -I src src/fmt.cmo -o src/fmt.cma
- ocamlfind ocamldep -package unix -modules src/fmt_tty.ml > src/fmt_tty.ml.depends
- ocamlfind ocamldep -package unix -modules src/fmt_tty.mli > src/fmt_tty.mli.depends
- ocamlfind ocamlc -c -g -bin-annot -safe-string -package unix -I src -I test -o src/fmt_tty.cmi src/fmt_tty.mli
- ocamlfind ocamlopt -c -g -bin-annot -safe-string -package unix -I src -I test -o src/fmt_tty.cmx src/fmt_tty.ml
- ocamlfind ocamlopt -a -package unix -I src src/fmt_tty.cmx -o src/fmt_tty.cmxa
- ocamlfind ocamlopt -shared -linkall -package unix -I src src/fmt_tty.cmxa -o src/fmt_tty.cmxs
- ocamlfind ocamlc -c -g -bin-annot -safe-string -package unix -I src -I test -o src/fmt_tty.cmo src/fmt_tty.ml
- ocamlfind ocamlc -a -package unix -I src src/fmt_tty.cmo -o src/fmt_tty.cma
- ocamlfind ocamldep -package compiler-libs.toplevel -modules src/fmt_top.ml > src/fmt_top.ml.depends
- ocamlfind ocamlc -c -g -bin-annot -safe-string -package compiler-libs.toplevel -I src -I test -o src/fmt_top.cmo src/fmt_top.ml
- + ocamlfind ocamlc -c -g -bin-annot -safe-string -package compiler-libs.toplevel -I src -I test -o src/fmt_top.cmo src/fmt_top.ml
- findlib: [WARNING] Interface topdirs.cmi occurs in several directories: /home/opam/.opam/4.12/lib/ocaml, /home/opam/.opam/4.12/lib/ocaml/compiler-libs
- ocamlfind ocamlopt -c -g -bin-annot -safe-string -package compiler-libs.toplevel -I src -I test -o src/fmt_top.cmx src/fmt_top.ml
- + ocamlfind ocamlopt -c -g -bin-annot -safe-string -package compiler-libs.toplevel -I src -I test -o src/fmt_top.cmx src/fmt_top.ml
- findlib: [WARNING] Interface topdirs.cmi occurs in several directories: /home/opam/.opam/4.12/lib/ocaml, /home/opam/.opam/4.12/lib/ocaml/compiler-libs
- File "_none_", line 1:
- Warning 58 [no-cmx-file]: no cmx file was found in path for module Toploop, and its interface was not compiled with -opaque
- ocamlfind ocamlopt -a -package compiler-libs.toplevel -I src src/fmt_top.cmx -o src/fmt_top.cmxa
- + ocamlfind ocamlopt -a -package compiler-libs.toplevel -I src src/fmt_top.cmx -o src/fmt_top.cmxa
- findlib: [WARNING] Interface topdirs.cmi occurs in several directories: /home/opam/.opam/4.12/lib/ocaml, /home/opam/.opam/4.12/lib/ocaml/compiler-libs
- ocamlfind ocamlopt -shared -linkall -package compiler-libs.toplevel -I src src/fmt_top.cmxa -o src/fmt_top.cmxs
- + ocamlfind ocamlopt -shared -linkall -package compiler-libs.toplevel -I src src/fmt_top.cmxa -o src/fmt_top.cmxs
- findlib: [WARNING] Interface topdirs.cmi occurs in several directories: /home/opam/.opam/4.12/lib/ocaml, /home/opam/.opam/4.12/lib/ocaml/compiler-libs
- ocamlfind ocamlc -a -package compiler-libs.toplevel -I src src/fmt_top.cmo -o src/fmt_top.cma
- + ocamlfind ocamlc -a -package compiler-libs.toplevel -I src src/fmt_top.cmo -o src/fmt_top.cma
- findlib: [WARNING] Interface topdirs.cmi occurs in several directories: /home/opam/.opam/4.12/lib/ocaml, /home/opam/.opam/4.12/lib/ocaml/compiler-libs
- # No parallelism done
-> compiled  fmt.0.9.0
Processing 117/147: [dune-private-libs: dune build] [menhir: dune build] [ppxlib: dune build] [ptime: ocaml build] [uunf: ocaml build]
-> installed fmt.0.9.0
Processing 118/147: [dune-private-libs: dune build] [menhir: dune build] [ppxlib: dune build] [ptime: ocaml build] [uunf: ocaml build]
Processing 119/147: [dune-private-libs: dune build] [logs: ocaml build] [menhir: dune build] [ppxlib: dune build] [ptime: ocaml build] [uunf: ocaml build]
- ocamlfind ocamlopt unix.cmxa -I /home/opam/.opam/4.12/lib/ocamlbuild /home/opam/.opam/4.12/lib/ocamlbuild/ocamlbuildlib.cmxa -linkpkg myocamlbuild.ml /home/opam/.opam/4.12/lib/ocamlbuild/ocamlbuild.cmx -o myocamlbuild
- ocamlfind ocamldep -modules src/ptime.ml > src/ptime.ml.depends
- ocamlfind ocamldep -modules src/ptime.mli > src/ptime.mli.depends
- ocamlfind ocamlc -c -g -bin-annot -safe-string -I src -I src-clock -o src/ptime.cmi src/ptime.mli
- ocamlfind ocamlopt -c -g -bin-annot -safe-string -I src -I src-clock -o src/ptime.cmx src/ptime.ml
- ocamlfind ocamlopt -a -I src src/ptime.cmx -o src/ptime.cmxa
- ocamlfind ocamlopt -shared -linkall -I src src/ptime.cmxa -o src/ptime.cmxs
- ocamlfind ocamlc -c -g -bin-annot -safe-string -I src -I src-clock -o src/ptime.cmo src/ptime.ml
- ocamlfind ocamlc -a -I src src/ptime.cmo -o src/ptime.cma
- ocamlfind ocamldep -package compiler-libs.toplevel -modules src/ptime_top.ml > src/ptime_top.ml.depends
- ocamlfind ocamlc -c -g -bin-annot -safe-string -package compiler-libs.toplevel -I src -I src-clock -o src/ptime_top.cmo src/ptime_top.ml
- + ocamlfind ocamlc -c -g -bin-annot -safe-string -package compiler-libs.toplevel -I src -I src-clock -o src/ptime_top.cmo src/ptime_top.ml
- findlib: [WARNING] Interface topdirs.cmi occurs in several directories: /home/opam/.opam/4.12/lib/ocaml, /home/opam/.opam/4.12/lib/ocaml/compiler-libs
- ocamlfind ocamlopt -c -g -bin-annot -safe-string -package compiler-libs.toplevel -I src -I src-clock -o src/ptime_top.cmx src/ptime_top.ml
- + ocamlfind ocamlopt -c -g -bin-annot -safe-string -package compiler-libs.toplevel -I src -I src-clock -o src/ptime_top.cmx src/ptime_top.ml
- findlib: [WARNING] Interface topdirs.cmi occurs in several directories: /home/opam/.opam/4.12/lib/ocaml, /home/opam/.opam/4.12/lib/ocaml/compiler-libs
- File "_none_", line 1:
- Warning 58 [no-cmx-file]: no cmx file was found in path for module Toploop, and its interface was not compiled with -opaque
- ocamlfind ocamlopt -a -package compiler-libs.toplevel -I src src/ptime_top.cmx -o src/ptime_top.cmxa
- + ocamlfind ocamlopt -a -package compiler-libs.toplevel -I src src/ptime_top.cmx -o src/ptime_top.cmxa
- findlib: [WARNING] Interface topdirs.cmi occurs in several directories: /home/opam/.opam/4.12/lib/ocaml, /home/opam/.opam/4.12/lib/ocaml/compiler-libs
- ocamlfind ocamlopt -shared -linkall -package compiler-libs.toplevel -I src src/ptime_top.cmxa -o src/ptime_top.cmxs
- + ocamlfind ocamlopt -shared -linkall -package compiler-libs.toplevel -I src src/ptime_top.cmxa -o src/ptime_top.cmxs
- findlib: [WARNING] Interface topdirs.cmi occurs in several directories: /home/opam/.opam/4.12/lib/ocaml, /home/opam/.opam/4.12/lib/ocaml/compiler-libs
- ocamlfind ocamlc -a -package compiler-libs.toplevel -I src src/ptime_top.cmo -o src/ptime_top.cma
- + ocamlfind ocamlc -a -package compiler-libs.toplevel -I src src/ptime_top.cmo -o src/ptime_top.cma
- findlib: [WARNING] Interface topdirs.cmi occurs in several directories: /home/opam/.opam/4.12/lib/ocaml, /home/opam/.opam/4.12/lib/ocaml/compiler-libs
- ocamlfind ocamlc -g -c src-clock/ptime_clock_stubs.c
- mv ptime_clock_stubs.o src-clock/ptime_clock_stubs.o
- ocamlfind ocamlmklib -o src-clock/ptime_clock_stubs -g src-clock/ptime_clock_stubs.o
- ocamlfind ocamldep -modules src-clock/ptime_clock.ml > src-clock/ptime_clock.ml.depends
- ocamlfind ocamldep -modules src-clock/ptime_clock.mli > src-clock/ptime_clock.mli.depends
- ocamlfind ocamlc -c -g -bin-annot -safe-string -I src-clock -I src -o src-clock/ptime_clock.cmi src-clock/ptime_clock.mli
- ocamlfind ocamlopt -c -g -bin-annot -safe-string -I src-clock -I src -o src-clock/ptime_clock.cmx src-clock/ptime_clock.ml
- ocamlfind ocamlopt -a -cclib -lptime_clock_stubs -cclib -lrt -I src-clock src-clock/ptime_clock.cmx -o src-clock/ptime_clock.cmxa
- ocamlfind ocamlopt -shared -linkall src-clock/libptime_clock_stubs.a -I src-clock src-clock/ptime_clock.cmxa -o src-clock/ptime_clock.cmxs
- ocamlfind ocamlc -c -g -bin-annot -safe-string -I src-clock -I src -o src-clock/ptime_clock.cmo src-clock/ptime_clock.ml
- ocamlfind ocamlc -a -dllib -lptime_clock_stubs -cclib -lrt -cclib -lptime_clock_stubs -cclib -lrt -I src-clock src-clock/ptime_clock.cmo -o src-clock/ptime_clock.cma
- # No parallelism done
-> compiled  ptime.1.1.0
Processing 119/147: [dune-private-libs: dune build] [logs: ocaml build] [menhir: dune build] [ppxlib: dune build] [uunf: ocaml build]
-> installed ptime.1.1.0
Processing 120/147: [dune-private-libs: dune build] [logs: ocaml build] [menhir: dune build] [ppxlib: dune build] [uunf: ocaml build]
-> compiled  dune-private-libs.3.13.0
Processing 120/147: [logs: ocaml build] [menhir: dune build] [ppxlib: dune build] [uunf: ocaml build]
-> installed dune-private-libs.3.13.0
Processing 121/147: [logs: ocaml build] [menhir: dune build] [ppxlib: dune build] [uunf: ocaml build]
Processing 122/147: [dune-site: rm] [logs: ocaml build] [menhir: dune build] [ppxlib: dune build] [uunf: ocaml build]
Processing 122/147: [dune-site: dune build] [logs: ocaml build] [menhir: dune build] [ppxlib: dune build] [uunf: ocaml build]
- ocamlfind ocamldep -modules src/logs.ml > src/logs.ml.depends
- ocamlfind ocamldep -modules src/logs.mli > src/logs.mli.depends
- ocamlfind ocamlc -c -g -bin-annot -safe-string -I src -I test -o src/logs.cmi src/logs.mli
- ocamlfind ocamlopt -c -g -bin-annot -safe-string -I src -I test -o src/logs.cmx src/logs.ml
- ocamlfind ocamlopt -a -I src src/logs.cmx -o src/logs.cmxa
- ocamlfind ocamlopt -shared -linkall -I src src/logs.cmxa -o src/logs.cmxs
- ocamlfind ocamlc -c -g -bin-annot -safe-string -I src -I test -o src/logs.cmo src/logs.ml
- ocamlfind ocamlc -a -I src src/logs.cmo -o src/logs.cma
- ocamlfind ocamldep -package fmt -modules src/logs_fmt.ml > src/logs_fmt.ml.depends
- ocamlfind ocamldep -package fmt -modules src/logs_fmt.mli > src/logs_fmt.mli.depends
- ocamlfind ocamlc -c -g -bin-annot -safe-string -package fmt -I src -I test -o src/logs_fmt.cmi src/logs_fmt.mli
- ocamlfind ocamlopt -c -g -bin-annot -safe-string -package fmt -I src -I test -o src/logs_fmt.cmx src/logs_fmt.ml
- ocamlfind ocamlopt -a -package fmt -I src src/logs_fmt.cmx -o src/logs_fmt.cmxa
- ocamlfind ocamlopt -shared -linkall -package fmt -I src src/logs_fmt.cmxa -o src/logs_fmt.cmxs
- ocamlfind ocamlc -c -g -bin-annot -safe-string -package fmt -I src -I test -o src/logs_fmt.cmo src/logs_fmt.ml
- ocamlfind ocamlc -a -package fmt -I src src/logs_fmt.cmo -o src/logs_fmt.cma
- ocamlfind ocamldep -package lwt -modules src/logs_lwt.ml > src/logs_lwt.ml.depends
- ocamlfind ocamldep -package lwt -modules src/logs_lwt.mli > src/logs_lwt.mli.depends
- ocamlfind ocamlc -c -g -bin-annot -safe-string -package lwt -I src -I test -o src/logs_lwt.cmi src/logs_lwt.mli
- ocamlfind ocamlopt -c -g -bin-annot -safe-string -package lwt -I src -I test -o src/logs_lwt.cmx src/logs_lwt.ml
- ocamlfind ocamlopt -a -package lwt -I src src/logs_lwt.cmx -o src/logs_lwt.cmxa
- ocamlfind ocamlopt -shared -linkall -package lwt -I src src/logs_lwt.cmxa -o src/logs_lwt.cmxs
- ocamlfind ocamlc -c -g -bin-annot -safe-string -package lwt -I src -I test -o src/logs_lwt.cmo src/logs_lwt.ml
- ocamlfind ocamlc -a -package lwt -I src src/logs_lwt.cmo -o src/logs_lwt.cma
- ocamlfind ocamldep -package compiler-libs.toplevel -modules src/logs_top.ml > src/logs_top.ml.depends
- ocamlfind ocamlc -c -g -bin-annot -safe-string -package compiler-libs.toplevel -I src -I test -o src/logs_top.cmo src/logs_top.ml
- + ocamlfind ocamlc -c -g -bin-annot -safe-string -package compiler-libs.toplevel -I src -I test -o src/logs_top.cmo src/logs_top.ml
- findlib: [WARNING] Interface topdirs.cmi occurs in several directories: /home/opam/.opam/4.12/lib/ocaml, /home/opam/.opam/4.12/lib/ocaml/compiler-libs
- ocamlfind ocamlopt -c -g -bin-annot -safe-string -package compiler-libs.toplevel -I src -I test -o src/logs_top.cmx src/logs_top.ml
- + ocamlfind ocamlopt -c -g -bin-annot -safe-string -package compiler-libs.toplevel -I src -I test -o src/logs_top.cmx src/logs_top.ml
- findlib: [WARNING] Interface topdirs.cmi occurs in several directories: /home/opam/.opam/4.12/lib/ocaml, /home/opam/.opam/4.12/lib/ocaml/compiler-libs
- File "_none_", line 1:
- Warning 58 [no-cmx-file]: no cmx file was found in path for module Toploop, and its interface was not compiled with -opaque
- ocamlfind ocamlopt -a -package compiler-libs.toplevel -I src src/logs_top.cmx -o src/logs_top.cmxa
- + ocamlfind ocamlopt -a -package compiler-libs.toplevel -I src src/logs_top.cmx -o src/logs_top.cmxa
- findlib: [WARNING] Interface topdirs.cmi occurs in several directories: /home/opam/.opam/4.12/lib/ocaml, /home/opam/.opam/4.12/lib/ocaml/compiler-libs
- ocamlfind ocamlopt -shared -linkall -package compiler-libs.toplevel -I src src/logs_top.cmxa -o src/logs_top.cmxs
- + ocamlfind ocamlopt -shared -linkall -package compiler-libs.toplevel -I src src/logs_top.cmxa -o src/logs_top.cmxs
- findlib: [WARNING] Interface topdirs.cmi occurs in several directories: /home/opam/.opam/4.12/lib/ocaml, /home/opam/.opam/4.12/lib/ocaml/compiler-libs
- ocamlfind ocamlc -a -package compiler-libs.toplevel -I src src/logs_top.cmo -o src/logs_top.cma
- + ocamlfind ocamlc -a -package compiler-libs.toplevel -I src src/logs_top.cmo -o src/logs_top.cma
- findlib: [WARNING] Interface topdirs.cmi occurs in several directories: /home/opam/.opam/4.12/lib/ocaml, /home/opam/.opam/4.12/lib/ocaml/compiler-libs
- ocamlfind ocamldep -package threads -modules src/logs_threaded.ml > src/logs_threaded.ml.depends
- ocamlfind ocamldep -package threads -modules src/logs_threaded.mli > src/logs_threaded.mli.depends
- ocamlfind ocamlc -c -g -bin-annot -safe-string -thread -package threads -I src -I test -o src/logs_threaded.cmi src/logs_threaded.mli
- ocamlfind ocamlopt -c -g -bin-annot -safe-string -thread -package threads -I src -I test -o src/logs_threaded.cmx src/logs_threaded.ml
- ocamlfind ocamlopt -a -thread -package threads -I src src/logs_threaded.cmx -o src/logs_threaded.cmxa
- ocamlfind ocamlopt -shared -linkall -thread -package threads -I src src/logs_threaded.cmxa -o src/logs_threaded.cmxs
- ocamlfind ocamlc -c -g -bin-annot -safe-string -thread -package threads -I src -I test -o src/logs_threaded.cmo src/logs_threaded.ml
- ocamlfind ocamlc -a -thread -package threads -I src src/logs_threaded.cmo -o src/logs_threaded.cma
- # No parallelism done
-> compiled  logs.0.7.0
Processing 122/147: [dune-site: dune build] [menhir: dune build] [ppxlib: dune build] [uunf: ocaml build]
-> installed logs.0.7.0
Processing 123/147: [dune-site: dune build] [menhir: dune build] [ppxlib: dune build] [uunf: ocaml build]
-> compiled  dune-site.3.13.0
Processing 123/147: [menhir: dune build] [ppxlib: dune build] [uunf: ocaml build]
-> installed dune-site.3.13.0
Processing 124/147: [menhir: dune build] [ppxlib: dune build] [uunf: ocaml build]
- (cd _build/default/lib/pack && ./pack.exe)
- Creating menhirLib.ml...
- Creating menhirLib.mli...
- (cd _build/default/src/stage2 && .bin/menhir --exn-carries-state --no-pager --require-aliases --strict parser.mly --compare-errors parserMessages.auto.messages --compare-errors parserMessages.messages) > _build/default/src/stage2/parserMessages.check
- Read 99 sample input sentences and 99 error messages.
- Read 99 sample input sentences and 47 error messages.
- (cd _build/default && src/stage2/.bin/menhir --exn-carries-state --no-pager --require-aliases --strict -lg 1 -la 1 -lc 1 -v src/stage2/parser.mly --base src/stage2/parser --infer-read-reply src/stage2/parser__mock.mli.inferred)
- Grammar has 56 nonterminal symbols, among which 1 start symbols.
- Grammar has 37 terminal symbols.
- Grammar has 129 productions.
- Built an LR(0) automaton with 199 states.
- The grammar is not SLR(1) -- 7 states have a conflict.
- The construction mode is no-pager.
- Built an LR(1) automaton with 308 states.
- One shift/reduce conflict was silently solved.
- Extra reductions on error were added in 50 states.
- Priority played a role in 0 of these states.
- 156 out of 308 states have a default reduction.
- 108 out of 308 states are represented.
- 44 out of 96 symbols keep track of their start position.
- 39 out of 96 symbols keep track of their end position.
- The StackLang code contains 4113 instructions in 277 blocks.
- The StackLang code comprises 5 mutually recursive groups.
- (cd _build/default/src/stage2 && .bin/menhir --exn-carries-state --no-pager --require-aliases --strict parser.mly --compile-errors parserMessages.messages) > _build/default/src/stage2/parserMessages.ml
- Read 99 sample input sentences and 47 error messages.
-> compiled  menhir.20231231
Processing 124/147: [ppxlib: dune build] [uunf: ocaml build]
-> installed menhir.20231231
Processing 125/147: [ppxlib: dune build] [uunf: ocaml build]
-> compiled  ppxlib.0.31.0
Processing 125/147: [uunf: ocaml build]
-> installed ppxlib.0.31.0
Processing 126/147: [uunf: ocaml build]
Processing 127/147: [lwt_ppx: dune build] [uunf: ocaml build]
Processing 128/147: [lwt_ppx: dune build] [ocf_ppx: dune build] [uunf: ocaml build]
Processing 129/147: [lwt_ppx: dune build] [ocf_ppx: dune build] [ppx_blob: dune build] [uunf: ocaml build]
Processing 130/147: [lwt_ppx: dune build] [ocf_ppx: dune build] [ppx_blob: dune build] [sedlex: dune build] [uunf: ocaml build]
-> compiled  ppx_blob.0.7.2
Processing 130/147: [lwt_ppx: dune build] [ocf_ppx: dune build] [sedlex: dune build] [uunf: ocaml build]
-> installed ppx_blob.0.7.2
Processing 131/147: [lwt_ppx: dune build] [ocf_ppx: dune build] [sedlex: dune build] [uunf: ocaml build]
- ocamlfind ocamldep -modules src/uunf_fmt.ml > src/uunf_fmt.ml.depends
- ocamlfind ocamlc -c -g -bin-annot -safe-string -I src -I test -o src/uunf_fmt.cmo src/uunf_fmt.ml
- ocamlfind ocamldep -modules src/uunf_tmap.ml > src/uunf_tmap.ml.depends
- ocamlfind ocamlc -c -g -bin-annot -safe-string -I src -I test -o src/uunf_tmap.cmo src/uunf_tmap.ml
- ocamlfind ocamlopt -c -g -bin-annot -safe-string -I src -I test -o src/uunf_fmt.cmx src/uunf_fmt.ml
- ocamlfind ocamldep -modules src/uunf_tmapbool.ml > src/uunf_tmapbool.ml.depends
- ocamlfind ocamlc -c -g -bin-annot -safe-string -I src -I test -o src/uunf_tmapbool.cmo src/uunf_tmapbool.ml
- ocamlfind ocamldep -modules src/uunf_tmapbyte.ml > src/uunf_tmapbyte.ml.depends
- ocamlfind ocamlc -c -g -bin-annot -safe-string -I src -I test -o src/uunf_tmapbyte.cmo src/uunf_tmapbyte.ml
- ocamlfind ocamldep -modules src/uunf_data.ml > src/uunf_data.ml.depends
- ocamlfind ocamlc -c -g -bin-annot -safe-string -I src -I test -o src/uunf_data.cmo src/uunf_data.ml
- ocamlfind ocamlopt -c -g -bin-annot -safe-string -I src -I test -o src/uunf_tmap.cmx src/uunf_tmap.ml
- ocamlfind ocamlopt -c -g -bin-annot -safe-string -I src -I test -o src/uunf_tmapbool.cmx src/uunf_tmapbool.ml
- ocamlfind ocamlopt -c -g -bin-annot -safe-string -I src -I test -o src/uunf_tmapbyte.cmx src/uunf_tmapbyte.ml
- ocamlfind ocamldep -modules src/uunf.ml > src/uunf.ml.depends
- ocamlfind ocamldep -modules src/uunf.mli > src/uunf.mli.depends
- ocamlfind ocamlc -c -g -bin-annot -safe-string -I src -I test -o src/uunf.cmi src/uunf.mli
- ocamlfind ocamlopt -c -g -bin-annot -safe-string -I src -I test -o src/uunf_data.cmx src/uunf_data.ml
- ocamlfind ocamlopt -c -g -bin-annot -safe-string -I src -I test -o src/uunf.cmx src/uunf.ml
- ocamlfind ocamlopt -a -I src src/uunf_fmt.cmx src/uunf_tmap.cmx src/uunf_tmapbool.cmx src/uunf_tmapbyte.cmx src/uunf_data.cmx src/uunf.cmx -o src/uunf.cmxa
- ocamlfind ocamlopt -shared -linkall -I src src/uunf.cmxa -o src/uunf.cmxs
- ocamlfind ocamlc -c -g -bin-annot -safe-string -I src -I test -o src/uunf.cmo src/uunf.ml
- ocamlfind ocamlc -a -I src src/uunf_fmt.cmo src/uunf_tmap.cmo src/uunf_tmapbool.cmo src/uunf_tmapbyte.cmo src/uunf_data.cmo src/uunf.cmo -o src/uunf.cma
- ocamlfind ocamldep -package uutf -modules src/uunf_string.ml > src/uunf_string.ml.depends
- ocamlfind ocamldep -package uutf -modules src/uunf_string.mli > src/uunf_string.mli.depends
- ocamlfind ocamlc -c -g -bin-annot -safe-string -package uutf -I src -I test -o src/uunf_string.cmi src/uunf_string.mli
- ocamlfind ocamlopt -c -g -bin-annot -safe-string -package uutf -I src -I test -o src/uunf_string.cmx src/uunf_string.ml
- ocamlfind ocamlopt -a -package uutf -I src src/uunf_string.cmx -o src/uunf_string.cmxa
- ocamlfind ocamlopt -shared -linkall -package uutf -I src src/uunf_string.cmxa -o src/uunf_string.cmxs
- ocamlfind ocamlc -c -g -bin-annot -safe-string -package uutf -I src -I test -o src/uunf_string.cmo src/uunf_string.ml
- ocamlfind ocamlc -a -package uutf -I src src/uunf_string.cmo -o src/uunf_string.cma
- # No parallelism done
-> compiled  uunf.15.0.0
Processing 131/147: [lwt_ppx: dune build] [ocf_ppx: dune build] [sedlex: dune build]
-> installed uunf.15.0.0
Processing 132/147: [lwt_ppx: dune build] [ocf_ppx: dune build] [sedlex: dune build]
-> compiled  lwt_ppx.2.1.0
Processing 132/147: [ocf_ppx: dune build] [sedlex: dune build]
-> installed lwt_ppx.2.1.0
Processing 133/147: [ocf_ppx: dune build] [sedlex: dune build]
Processing 133/147: [ocf_ppx: dune install] [sedlex: dune build]
-> compiled  ocf_ppx.0.8.0
Processing 133/147: [sedlex: dune build]
-> installed ocf_ppx.0.8.0
Processing 134/147: [sedlex: dune build]
+ /home/opam/.opam/4.12/bin/dune "build" "-p" "sedlex" "-j" "255" "@install" (CWD=/home/opam/.opam/4.12/.opam-switch/build/sedlex.3.2)
-> compiled  sedlex.3.2
-> installed sedlex.3.2
Processing 136/147: [iri: dune build]
+ /home/opam/.opam/4.12/bin/dune "build" "-p" "iri" "-j" "255" "--promote-install-files=false" "@install" (CWD=/home/opam/.opam/4.12/.opam-switch/build/iri.0.7.0)
Processing 136/147: [iri: dune install]
+ /home/opam/.opam/4.12/bin/dune "install" "-p" "iri" "--create-install-files" "iri" (CWD=/home/opam/.opam/4.12/.opam-switch/build/iri.0.7.0)
-> compiled  iri.0.7.0
-> installed iri.0.7.0
Processing 138/147: [xtmpl: dune build]
+ /home/opam/.opam/4.12/bin/dune "build" "-p" "xtmpl" "-j" "255" "--promote-install-files=false" "@install" (CWD=/home/opam/.opam/4.12/.opam-switch/build/xtmpl.0.19.0)
Processing 138/147: [xtmpl: dune install]
+ /home/opam/.opam/4.12/bin/dune "install" "-p" "xtmpl" "--create-install-files" "xtmpl" (CWD=/home/opam/.opam/4.12/.opam-switch/build/xtmpl.0.19.0)
-> compiled  xtmpl.0.19.0
-> installed xtmpl.0.19.0
Processing 140/147: [higlo: dune build]
Processing 141/147: [higlo: dune build] [xtmpl_ppx: dune build]
Processing 141/147: [higlo: dune install] [xtmpl_ppx: dune build]
-> compiled  higlo.0.8
Processing 141/147: [xtmpl_ppx: dune build]
-> installed higlo.0.8
Processing 142/147: [xtmpl_ppx: dune build]
+ /home/opam/.opam/4.12/bin/dune "build" "-p" "xtmpl_ppx" "-j" "255" "--promote-install-files=false" "@install" (CWD=/home/opam/.opam/4.12/.opam-switch/build/xtmpl_ppx.0.19.0)
Processing 142/147: [xtmpl_ppx: dune install]
+ /home/opam/.opam/4.12/bin/dune "install" "-p" "xtmpl_ppx" "--create-install-files" "xtmpl_ppx" (CWD=/home/opam/.opam/4.12/.opam-switch/build/xtmpl_ppx.0.19.0)
-> compiled  xtmpl_ppx.0.19.0
-> installed xtmpl_ppx.0.19.0
Processing 144/147: [stog: dune build]
+ /home/opam/.opam/4.12/bin/dune "build" "-p" "stog" "-j" "255" "--promote-install-files=false" "@install" (CWD=/home/opam/.opam/4.12/.opam-switch/build/stog.0.20.0)
- (cd _build/default && /home/opam/.opam/4.12/bin/menhir lib/filter_parser.mly --base lib/filter_parser --infer-read-reply lib/filter_parser__mock.mli.inferred)
- Warning: 3 states have shift/reduce conflicts.
- Warning: 6 shift/reduce conflicts were arbitrarily resolved.
Processing 144/147: [stog: dune install]
+ /home/opam/.opam/4.12/bin/dune "install" "-p" "stog" "--create-install-files" "stog" (CWD=/home/opam/.opam/4.12/.opam-switch/build/stog.0.20.0)
-> compiled  stog.0.20.0
-> installed stog.0.20.0
Processing 146/147: [stog-writing: make all]
+ /usr/bin/make "all" (CWD=/home/opam/.opam/4.12/.opam-switch/build/stog-writing.0.19.0)
- ocamlfind ocamlc -I +ocamldoc -g -annot -package menhirLib,xtmpl,stog,ocf -rectypes -c bibtex.mli
- findlib: [WARNING] Interface topdirs.cmi occurs in several directories: /home/opam/.opam/4.12/lib/ocaml/compiler-libs, /home/opam/.opam/4.12/lib/ocaml
- ocamlfind: [WARNING] Package `threads': Linking problems may arise because of the missing -thread or -vmthread switch
- menhir bib_parser.mly
- Warning: 5 end-of-stream conflicts were arbitrarily resolved.
- File "<standard.mly>", line 109, characters 18-18:
- Warning: production option(EOF) -> is never reduced.
- Warning: in total, 1 production is never reduced.
- Error: the code back-end requires the type of every nonterminal symbol to be
- known. Please specify the type of every symbol via %type declarations, or
- enable type inference (look up --infer in the manual).
- Type inference is automatically enabled when Menhir is used via Dune,
- provided the dune-project file says (using menhir 2.0) or later.
- The types of the following nonterminal symbols are unknown:
- entry
- field
- list(entry)
- list(field)
- option(COMMA)
- option(EOF)
- make: *** [Makefile:83: bib_parser.mli] Error 1
[ERROR] The compilation of stog-writing.0.19.0 failed at "make all".

#=== ERROR while compiling stog-writing.0.19.0 ================================#
# context              2.1.5 | linux/x86_64 | ocaml-base-compiler.4.12.1 | file:///src
# path                 ~/.opam/4.12/.opam-switch/build/stog-writing.0.19.0
# command              /usr/bin/make all
# exit-code            2
# env-file             ~/.opam/log/stog-writing-113-ee0b74.env
# output-file          ~/.opam/log/stog-writing-113-ee0b74.out
### output ###
# ocamlfind ocamlc -I +ocamldoc -g -annot -package menhirLib,xtmpl,stog,ocf -rectypes -c bibtex.mli
# findlib: [WARNING] Interface topdirs.cmi occurs in several directories: /home/opam/.opam/4.12/lib/ocaml/compiler-libs, /home/opam/.opam/4.12/lib/ocaml
# ocamlfind: [WARNING] Package `threads': Linking problems may arise because of the missing -thread or -vmthread switch
# menhir bib_parser.mly
# Warning: 5 end-of-stream conflicts were arbitrarily resolved.
# File "<standard.mly>", line 109, characters 18-18:
# Warning: production option(EOF) -> is never reduced.
# Warning: in total, 1 production is never reduced.
# Error: the code back-end requires the type of every nonterminal symbol to be
# known. Please specify the type of every symbol via %type declarations, or
# enable type inference (look up --infer in the manual).
# Type inference is automatically enabled when Menhir is used via Dune,
# provided the dune-project file says (using menhir 2.0) or later.
# The types of the following nonterminal symbols are unknown:
# entry
# field
# list(entry)
# list(field)
# option(COMMA)
# option(EOF)
# make: *** [Makefile:83: bib_parser.mli] Error 1



<><> Error report <><><><><><><><><><><><><><><><><><><><><><><><><><><><><><><>
+- The following actions failed
| - build stog-writing 0.19.0
+- 
+- The following changes have been performed
| - install angstrom            0.16.0
| - install base-bytes          base
| - install bigstringaf         0.9.1
| - install cppo                1.6.9
| - install csexp               1.5.2
| - install dune-build-info     3.13.0
| - install dune-configurator   3.13.0
| - install dune-private-libs   3.13.0
| - install dune-site           3.13.0
| - install dyn                 3.13.0
| - install fmt                 0.9.0
| - install gen                 1.1
| - install higlo               0.8
| - install iri                 0.7.0
| - install logs                0.7.0
| - install lwt                 5.7.0
| - install lwt_ppx             2.1.0
| - install menhir              20231231
| - install menhirCST           20231231
| - install menhirLib           20231231
| - install menhirSdk           20231231
| - install ocaml-compiler-libs v0.12.4
| - install ocaml-syntax-shims  1.0.0
| - install ocamlbuild          0.14.3
| - install ocf                 0.8.0
| - install ocf_ppx             0.8.0
| - install ocplib-endian       1.2
| - install ordering            3.13.0
| - install pp                  1.2.0
| - install ppx_blob            0.7.2
| - install ppx_derivers        1.2.1
| - install ppxlib              0.31.0
| - install ptime               1.1.0
| - install re                  1.11.0
| - install sedlex              3.2
| - install seq                 base
| - install sexplib0            v0.16.0
| - install stdlib-shims        0.3.0
| - install stdune              3.13.0
| - install stog                0.20.0
| - install stringext           1.6.0
| - install topkg               1.0.7
| - install uri                 4.4.0
| - install uunf                15.0.0
| - install uutf                1.0.3
| - install xtmpl               0.19.0
| - install xtmpl_ppx           0.19.0
| - install yojson              2.1.2
+- 
# Run eval $(opam env) to update the current shell environment

The former state can be restored with:
    /usr/bin/opam switch import "/home/opam/.opam/4.12/.opam-switch/backup/state-20240129183239.export"
'opam --cli=2.1 install stog-writing.0.19.0 yojson.2.1.2 xtmpl_ppx.0.19.0 xtmpl.0.19.0 uutf.1.0.3 uunf.15.0.0 uri.4.4.0 topkg.1.0.7 stringext.1.6.0 stog.0.20.0 stdune.3.13.0 stdlib-shims.0.3.0 sexplib0.v0.16.0 seq.base sedlex.3.2 re.1.11.0 ptime.1.1.0 ppxlib.0.31.0 ppx_derivers.1.2.1 ppx_blob.0.7.2 pp.1.2.0 ordering.3.13.0 ocplib-endian.1.2 ocf_ppx.0.8.0 ocf.0.8.0 ocamlfind.1.9.6 ocamlbuild.0.14.3 ocaml-syntax-shims.1.0.0 ocaml-compiler-libs.v0.12.4 menhirSdk.20231231 menhirLib.20231231 menhirCST.20231231 menhir.20231231 lwt_ppx.2.1.0 lwt.5.7.0 logs.0.7.0 iri.0.7.0 higlo.0.8 gen.1.1 fmt.0.9.0 dyn.3.13.0 dune-site.3.13.0 dune-private-libs.3.13.0 dune-configurator.3.13.0 dune-build-info.3.13.0 dune.3.13.0 csexp.1.5.2 cppo.1.6.9 bigstringaf.0.9.1 base-bytes.base angstrom.0.16.0 --verbose --yes --confirm-level=unsafe-yes' failed.